program: Gaussian 09
title: 000193872
version: EM64L-G09RevD.01
frameworkgroup: C1[X(C7H13NO3)]
method: RPBEPBE
basis: SDD
operation: Freq
keyword: #p
keyword: freq=noraman
keyword: PBEPBE/SDD
title: #p freq=noraman PBEPBE/SDD
converged: YES YES NO NO
title: Mulliken charges:
elementType: O O O N C C C C C C C H H H H H H H H H H H H H
charge: -0.275535 -0.448117 -0.215953 -0.397786 -0.173119 -0.366854 -0.709215 0.246719 -0.699509 -0.388532 0.180090 0.190310 0.231027 0.199364 0.215682 0.213665 0.243961 0.219993 0.230627 0.200751 0.348642 0.280043 0.279829 0.393919
chargesum: 0.00000
title: Mulliken charges with hydrogens summed into heavy atoms:
elementType: O O O N C C C C C C C
charge: -0.275535 -0.054198 -0.215953 -0.049145 0.017191 0.063537 -0.035906 0.246719 -0.048138 0.171340 0.180090
polarizability: 1.13616832e+02 2.92557849e+00 7.85368948e+01 -1.32306715e+00 5.86836102e+00 8.36510860e+01
1716.lowfreq: -17.3750 -5.8645 -0.5876 0.0003 0.0008 0.0008 17.0934 39.2319 46.2523
frequency: 16.7289 39.1327 46.1428 83.3970 100.6116 144.4136 194.9055 215.3049 221.0478 249.2774 277.8454 286.4214 361.8161 429.5679 491.5723 534.1832 542.5823 592.9062 637.3769 651.8177 722.7556 782.6443 808.0218 843.9890 914.0403 962.0105 977.8803 1012.3641 1030.5766 1077.1805 1089.7671 1102.4293 1107.6750 1170.5235 1207.3474 1208.3178 1255.6140 1273.4483 1299.9592 1316.7601 1328.7849 1357.2114 1384.6707 1391.1672 1457.6392 1460.8529 1471.2850 1475.1620 1478.7304 1481.8545 1485.4721 1608.6263 1684.0767 2962.8844 2973.5620 2983.0020 2985.4981 2989.3283 3024.3877 3039.6755 3070.9306 3076.3096 3078.8637 3092.1099 3530.9993 3560.6172
redmass: 3.7236 5.2881 5.7955 2.4542 4.8245 2.0313 2.0571 1.1093 1.6220 4.1425 2.8724 3.7088 3.5932 3.2976 1.8715 4.8560 4.0198 1.1169 2.5462 1.4430 4.9961 2.2629 1.7883 2.4117 3.0909 1.2285 2.0457 1.5926 3.0061 2.1187 2.0773 2.3558 2.3860 2.3342 1.1786 1.6211 1.3025 1.2455 2.1035 1.5179 1.4612 1.6057 1.2067 1.2164 1.1043 1.0722 1.1264 1.5011 1.0556 1.0517 1.2031 6.2652 9.1931 1.0823 1.0363 1.0391 1.0576 1.0602 1.0989 1.1003 1.1004 1.0998 1.1000 1.1003 1.0644 1.0783
irintensity: 0.0815 8.9932 0.3724 0.6287 1.0420 0.0669 2.4921 0.9878 2.6713 1.9716 5.0719 10.1016 4.1304 5.7592 42.8206 8.8397 50.8950 42.3976 0.8453 194.6509 3.1763 2.9644 14.8675 12.7814 37.2956 10.5045 0.7542 8.2298 5.0058 150.6118 88.0307 10.4572 2.2661 0.5258 7.3125 25.0427 2.8042 1.0528 35.9535 24.0649 2.2598 4.3922 6.3214 16.9723 4.9914 2.1621 94.1534 160.6743 17.2990 15.5168 122.8464 123.0575 266.0572 28.6180 36.7856 16.5790 53.6051 21.0376 4.8024 1.7621 50.2441 29.9547 59.6614 28.1471 31.5445 57.0067
temp: 298.150 k
press: 1.00000 atm
elementType: 8 8 8 7 6 6 6 6 6 6 6 1 1 1 1 1 1 1 1 1 1 1 1 1
symmnumber: 1
zpe: 518665.2 jmol-1
zpe.correction: 0.197549 hartree
zpe.thermalcorrener: 0.210655 hartree
zpe.thermalcorrenthalpy: 0.211599 hartree
zpe.thermalcorrgfe: 0.155837 hartree
zpe.sumelectzpe: -554.109151 hartree
zpe.sumelectthermal: -554.096045 hartree
zpe.sumelectthermalent: -554.095101 hartree
zpe.sumelectthermalfe: -554.150863 hartree
dipole: 0.0208 2.0060 3.9109
dipole: 4.3954
quadrupole: -70.1669 -67.0205 -67.5488
quadrupole: 1.1418 4.2185 -1.6828
quadrupole: -1.9215 1.2249 0.6966 1.1418 4.2185 -1.6828
hfenergy: -554.3067001 hartree
pointgroup: C01 [X(C7H13N1O3)]
dipole: 0.0914098 0.6122512 -1.6147014 debye
dipolederiv: -0.7087973 -0.0109794 0.0640263 0.1100837 -0.4483052 0.1703774 -0.2353828 0.1939862 -0.8292335 -0.4010859 -0.046687 0.1018466 -0.0810289 -0.5081078 0.2534015 0.1944039 0.2424439 -1.1069788 -1.1175351 -0.0308755 0.2410941 0.0605636 -0.3535814 0.0736792 0.0345741 0.0917937 -0.5710099 -1.171641 0.1284508 -0.2344356 0.128796 -0.4467854 0.0403106 -0.2548175 0.0428178 -0.4826756 -0.1718449 -0.0178796 0.1044747 -0.0024548 0.0105717 -0.0412497 0.0880487 -0.0222099 0.0732203 0.1195088 0.0382681 -0.037274 0.0655781 0.0900258 -0.0168826 0.048055 0.0117807 0.0826255 0.0300403 0.0168694 -0.0084104 -0.0447203 -0.02041 0.0273458 0.0352452 -0.0198184 0.0425615 1.4543724 -0.1328534 0.1613892 -0.2360969 0.2692998 -0.3027539 0.3802108 -0.3383079 0.9163801 0.0403308 0.0109534 0.0012669 0.0216925 -0.073125 -0.0388677 -0.0088792 -0.0496133 0.0879244 0.2783963 0.083637 -0.1748877 0.1740147 0.2472531 0.1115146 -0.4261625 0.1262129 0.0412019 1.4576249 -0.0279979 -0.1908974 -0.0887828 0.3758072 -0.4137833 -0.0735609 -0.4183167 1.3324531 -0.0189909 0.0338761 -0.0836948 0.0406559 -0.0086745 0.0921277 -0.0603017 0.0730932 -0.1302162 0.085015 0.0182941 -0.0296712 0.0418312 0.0046642 0.0737807 -0.085729 0.0453607 -0.0714835 -0.1613531 -0.002342 0.1061166 -0.0141514 0.0293749 -0.0206366 0.12483 -0.0207567 0.0121106 0.0090632 -0.1102636 -0.0894382 -0.0673914 -0.0641465 -0.0839872 -0.0652497 -0.1007221 0.0307645 -0.1228154 0.0116716 0.1312482 -0.0159939 0.0667992 0.0213042 0.1258679 0.0061265 0.0257025 0.0937554 0.0299043 -0.0265918 0.0229513 0.0592092 0.0305915 -0.0812988 0.0957523 -0.0591679 -0.024888 -0.127741 -0.077266 -0.1065964 -0.0678082 -0.0754883 -0.0797578 -0.0910412 0.0502273 -0.0971193 0.0394859 0.1128453 0.0115478 0.0808383 0.0210639 0.120447 0.0032811 0.0149686 0.0711011 0.0524646 -0.0535333 0.0311672 0.0312502 0.0463774 -0.0525568 0.1168262 -0.1360959 0.2717026 -0.0086618 0.0522449 -0.0193986 0.2943632 0.0486306 0.0978465 0.0448852 0.1884833 0.0071549 0.0076206 -0.0139056 0.0155916 0.0565888 -0.0709686 0.1027027 -0.0711609 0.0290677 -0.0111918 -0.0040722 -0.004841 -0.0832427 -0.0187423 0.0256671 0.0776846 0.0132351 0.1090899 0.089197 0.0488576 -0.0517059 0.0353844 0.3936407 0.0284458 -0.0062197 0.0243516 0.3500803 unknown
polarizability: 113.6256777|-2.7604353|77.3013876|0.7733306|-5.3319623|84.8777476 unknown
InChI: InChI=1S/C7H13NO3/c1-3-5(2)7(11)8-4-6(9)10/h5,8-9H,3-4H2,1-2H3
charge 0 multiplicity 1
24 atoms
O  0.799212 -1.006692 1.52448
O  -2.62962 0.468139 -1.577827
O  -4.122606 -0.049545 0.12896
N  -0.471157 -0.246067 -0.252494
C  1.991675 -0.362753 -0.537564
C  2.949884 0.649161 0.150354
C  2.685951 -1.731672 -0.751878
C  0.741139 -0.564827 0.333684
C  2.369675 2.074427 0.264919
C  -1.719498 -0.418288 0.489393
C  -2.950294 0.001285 -0.290729
H  1.691071 0.050684 -1.52357
H  3.190055 0.257974 1.157482
H  3.896749 0.674763 -0.424489
H  2.028312 -2.445022 -1.281333
H  3.608895 -1.605665 -1.346612
H  2.952851 -2.172678 0.224516
H  3.092786 2.757404 0.746396
H  1.4472 2.082814 0.874144
H  2.124809 2.490849 -0.731122
H  -0.525678 0.12088 -1.204214
H  -1.699231 0.156615 1.436276
H  -1.853392 -1.47351 0.800025
H  -3.460488 0.733227 -2.055997
