program: Gaussian 09
title: 000193868
version: EM64L-G09RevD.01
frameworkgroup: C1[X(C10H15NO2)]
method: RPBEPBE
basis: SDD
operation: Freq
keyword: #p
keyword: freq=noraman
keyword: PBEPBE/SDD
title: #p freq=noraman PBEPBE/SDD
converged: YES YES NO NO
title: Mulliken charges:
elementType: O O N C C C C C C C C C C H H H H H H H H H H H H H H H
charge: -0.300906 -0.292912 -0.390064 -0.161562 0.099771 0.248407 -0.186744 -0.705321 -0.248427 0.117201 -0.751806 -0.255205 -0.669185 0.239872 0.217939 0.208636 0.217836 0.239574 0.294603 0.234717 0.268854 0.266284 0.182631 0.230355 0.214143 0.210627 0.220055 0.250627
chargesum: 0.00000
title: Mulliken charges with hydrogens summed into heavy atoms:
elementType: O O N C C C C C C C C C C
charge: -0.300906 -0.292912 -0.095462 0.078310 0.099771 0.248407 0.031195 -0.039275 -0.013710 0.117201 -0.034037 0.189294 0.012124
polarizability: 1.68662535e+02 3.75771664e+00 1.28503637e+02 1.18508569e+00 5.69061223e+00 7.94602919e+01
1716.lowfreq: -8.0649 -4.6939 0.0009 0.0009 0.0011 2.5400 46.9034 57.2539 70.2068
frequency: 46.7869 57.1896 70.2049 96.3770 120.6090 146.3025 161.3227 181.4611 216.6524 221.9971 279.1016 306.2541 335.8884 389.0399 409.1522 427.4855 480.9423 506.8811 512.4629 543.0301 592.9859 640.7479 707.7549 721.3796 736.6342 779.2439 811.6930 849.0588 880.4784 915.6528 941.9366 985.6469 992.3162 1033.3507 1036.5224 1055.3833 1064.5182 1093.0173 1095.1021 1150.3041 1161.1720 1196.3041 1238.6564 1282.2168 1299.3733 1304.0412 1333.1431 1359.9969 1366.3405 1385.0859 1387.1636 1408.4663 1438.9773 1452.4276 1461.0100 1462.9972 1466.4853 1473.3845 1482.8453 1484.3873 1575.9995 1617.2906 1679.6135 2972.0229 2985.6703 2988.6165 3007.0247 3022.6987 3068.6098 3080.6429 3081.3656 3087.0357 3089.1589 3102.5794 3112.7306 3142.9442 3176.7166 3577.0713
redmass: 2.7996 3.4238 2.8215 3.3805 1.3028 2.5925 2.7881 3.3751 1.0612 1.2743 2.8215 3.5166 3.2806 5.0197 3.2646 3.9702 3.6464 2.3680 1.7590 3.0228 4.2944 3.5595 3.7665 1.9180 2.7097 3.1175 1.4165 2.9870 2.4173 1.2952 1.9555 3.2440 1.7741 3.1762 1.7766 1.8723 2.4197 1.9792 2.0149 1.7004 2.4197 1.2467 3.2478 1.1125 1.3382 1.7883 1.8880 1.3387 1.2818 1.4490 1.2787 1.2019 1.0503 1.1132 1.0447 1.1357 1.0689 1.0598 2.1877 1.0590 7.4885 5.0878 6.1767 1.0347 1.0402 1.0361 1.0842 1.0585 1.0989 1.0973 1.0990 1.1024 1.1008 1.0963 1.1048 1.0860 1.1012 1.0779
irintensity: 0.8431 2.7016 2.3650 1.0321 1.2630 0.8496 1.3307 1.2017 0.3690 1.4338 5.5082 3.5514 19.5825 1.4884 4.3159 1.5367 1.6990 12.8466 68.2224 7.6795 2.0243 3.1539 11.4261 71.8283 9.4518 15.2666 0.9977 1.0919 8.2068 1.0705 20.0301 107.4099 1.7354 223.5331 100.7991 21.7312 10.0635 32.2358 8.9990 41.5528 10.4803 13.6743 197.1080 0.6358 13.8337 5.5967 22.9828 1.7304 13.3790 15.0301 25.8411 49.6065 20.5808 30.6469 17.8405 41.9569 11.2053 16.0573 178.8119 25.8391 367.0452 90.4018 38.2313 36.1957 39.5899 25.8193 10.2425 44.6581 34.8564 23.3672 30.8142 15.1534 21.4641 6.9965 35.6247 3.0609 31.8984 50.1611
temp: 298.150 k
press: 1.00000 atm
elementType: 8 8 7 6 6 6 6 6 6 6 6 6 6 1 1 1 1 1 1 1 1 1 1 1 1 1 1 1
symmnumber: 1
zpe: 612518.7 jmol-1
zpe.correction: 0.233296 hartree
zpe.thermalcorrener: 0.247411 hartree
zpe.thermalcorrenthalpy: 0.248355 hartree
zpe.thermalcorrgfe: 0.192330 hartree
zpe.sumelectzpe: -594.253605 hartree
zpe.sumelectthermal: -594.239490 hartree
zpe.sumelectthermalent: -594.238546 hartree
zpe.sumelectthermalfe: -594.294571 hartree
dipole: 2.6750 -0.1891 0.1789
dipole: 2.6877
quadrupole: -60.3766 -77.5881 -80.1051
quadrupole: 7.9734 1.2678 2.1435
quadrupole: 12.3133 -4.8981 -7.4152 7.9734 1.2678 2.1435
hfenergy: -594.4869009 hartree
pointgroup: C01 [X(C10H15N1O2)]
dipole: -1.0542844 -0.0406057 0.070353 debye
polarizability: 166.7276446|9.2218717|106.8596583|-3.3944105|-25.9103908|103.0391615 unknown
InChI: InChI=1S/C10H15NO2/c1-4-13-10(12)9-7(2)5-6-11-8(9)3/h5-7,11H,4H2,1-3H3
charge 0 multiplicity 1
28 atoms
O  1.804596 0.183087 -0.987885
O  1.738892 -1.400185 0.732909
N  -2.56747 -1.00404 0.529696
C  -0.876203 0.69159 -1.075345
C  -0.334339 -0.38991 -0.120083
C  -1.188516 -1.124934 0.699897
C  -2.345224 0.439748 -1.38517
C  -0.685552 2.120955 -0.478135
C  -3.12767 -0.316113 -0.570335
C  1.111463 -0.612704 -0.037731
C  -0.765977 -2.113647 1.766907
C  3.283967 0.028629 -1.008957
C  3.947751 0.971529 0.000878
H  -0.289116 0.65568 -2.011578
H  -2.79274 0.928658 -2.256806
H  -1.071278 2.890386 -1.174299
H  -1.231069 2.217557 0.477942
H  0.386311 2.318397 -0.300437
H  -3.175171 -1.555899 1.133392
H  -4.199239 -0.46566 -0.72827
H  -0.047862 -1.660718 2.468487
H  -0.237465 -2.973049 1.320045
H  -1.643786 -2.484392 2.329607
H  3.536052 -1.023894 -0.789152
H  3.561063 0.278169 -2.046806
H  5.048597 0.900977 -0.084494
H  3.653341 2.01931 -0.185688
H  3.662742 0.697274 1.030311
