program: Gaussian 09
title: 000193867
version: EM64L-G09RevD.01
frameworkgroup: C1[X(C15H17ClN2O2)]
method: RPBEPBE
basis: SDD
operation: Freq
keyword: #p
keyword: freq=noraman
keyword: PBEPBE/SDD
title: #p freq=noraman PBEPBE/SDD
converged: YES YES NO NO
title: Mulliken charges:
elementType: Cl O O N N C C C C C C C C C C C C C C C H H H H H H H H H H H H H H H H H
charge: -0.081800 -0.380301 -0.270533 -0.430305 -0.667258 -0.326893 0.033369 0.615897 -0.346583 0.364484 0.178871 -0.339122 -0.357039 0.163793 -0.811304 -0.244927 -0.242879 -0.236803 -0.249450 -0.663619 0.282158 0.244842 0.292696 0.248128 0.254763 0.224498 0.230708 0.385977 0.290805 0.250708 0.224230 0.229523 0.243985 0.208245 0.211923 0.213151 0.256062
chargesum: 0.00000
title: Mulliken charges with hydrogens summed into heavy atoms:
elementType: Cl O O N N C C C C C C C C C C C C C C C
charge: -0.081800 -0.380301 -0.270533 -0.137609 0.009524 -0.044735 0.033369 0.615897 -0.101741 0.364484 0.178871 -0.339122 -0.108911 0.163793 -0.101335 0.005781 -0.018649 -0.007280 0.202781 0.017517
polarizability: 2.11306884e+02 -1.34981277e+01 2.02201620e+02 -1.34482853e+01 3.12272023e+00 1.71402162e+02
1716.lowfreq: -6.9893 0.0006 0.0018 0.0025 4.5164 7.6548 26.7413 32.3344 44.1049
frequency: 26.7103 32.3007 44.0783 57.1729 64.6645 99.7979 102.9849 131.0445 134.2016 151.9407 170.2010 178.2460 220.8454 227.0186 276.2851 278.8433 295.3029 309.1975 327.4796 344.6086 387.6743 390.9178 398.0323 430.3410 447.7998 457.3529 510.4714 527.1874 534.7655 567.4638 599.1996 611.8652 649.0571 669.5897 696.1521 706.3347 727.9299 741.6263 755.7924 772.6845 792.4954 806.2329 830.1541 848.3614 871.3044 942.1301 946.4209 958.1490 969.9486 983.8263 1009.2792 1024.3974 1036.7297 1050.8578 1065.9008 1094.7783 1101.9055 1119.6890 1149.4224 1165.7214 1170.9313 1177.5042 1217.6988 1245.9210 1258.4937 1281.3963 1290.3697 1319.2186 1327.8185 1354.1643 1378.3442 1386.9947 1397.9609 1401.5629 1424.5169 1450.4654 1452.9053 1461.6095 1465.0217 1469.3921 1483.7094 1507.5405 1573.1568 1581.6503 1600.1225 1611.8019 1642.8806 1712.3302 2964.4111 2988.3715 3002.1562 3025.7010 3035.4241 3080.3004 3089.3565 3108.4356 3113.2701 3125.7552 3139.3703 3154.2128 3165.4562 3171.0512 3383.1293 3562.4278 3626.1364
redmass: 6.1805 4.9790 3.0782 3.7974 4.4434 4.4510 6.7577 4.4600 3.1628 1.3584 3.6788 2.8723 3.4346 1.4354 4.3151 2.6150 1.5602 3.4217 3.0388 3.5441 5.7994 4.2116 5.9344 3.1561 3.1614 1.3504 4.6132 4.6316 4.0628 4.8720 5.1559 4.3044 5.6892 7.0263 4.1540 3.3531 2.2999 1.7220 1.5408 2.7569 2.6170 1.3023 2.1061 2.3962 1.5770 3.7947 1.4637 1.7008 3.3866 1.3303 6.8279 3.8429 2.1647 1.4837 1.6615 2.1437 2.1668 1.7969 1.6498 1.2219 2.0527 1.8997 2.1786 1.4798 3.0332 1.1135 1.7420 1.6614 1.6244 1.3072 5.3613 1.2379 1.6148 1.7530 2.1877 2.4378 1.1028 1.0441 1.0449 1.1110 1.0504 3.9317 4.8069 1.6339 7.1480 5.5786 2.5931 6.7980 1.0396 1.0361 1.0830 1.0585 1.0975 1.0999 1.1017 1.0958 1.1050 1.0852 1.0899 1.0951 1.0925 1.0992 1.0564 1.0772 1.0935
irintensity: 0.0704 0.3598 1.1248 5.1854 0.6898 0.5419 0.5643 0.3542 1.0271 0.6546 0.5646 2.4418 3.5701 4.0728 1.0481 16.9432 52.8127 4.8013 16.7013 11.3883 4.1043 36.6247 6.6161 3.2280 8.6058 157.5719 4.0856 2.4038 5.7391 1.3034 0.7693 5.4086 0.8000 23.4521 35.8857 31.4414 40.5768 96.6864 65.8199 19.7311 1.6234 1.8153 21.0742 17.6193 5.2352 147.5490 7.2710 17.3050 22.3151 0.2026 64.2975 254.6351 5.3043 5.8382 20.1839 23.6179 6.7160 2.6642 17.5748 6.6079 41.8694 1.3261 106.3092 13.4242 10.5434 0.5009 13.8512 13.0173 14.3137 1.5662 8.0425 30.3858 9.2761 33.9596 19.9297 29.9166 22.3421 14.3891 16.8177 57.0621 9.1696 530.6209 10.4267 31.7077 0.5209 266.4488 340.8653 90.9482 50.3882 27.4984 1.4706 44.0487 23.6996 30.0246 14.8070 12.7693 30.6356 0.8433 6.7957 20.8397 8.4873 19.8872 170.3865 34.1900 49.1036
temp: 298.150 k
press: 1.00000 atm
elementType: 17 8 8 7 7 6 6 6 6 6 6 6 6 6 6 6 6 6 6 6 1 1 1 1 1 1 1 1 1 1 1 1 1 1 1 1 1
symmnumber: 1
zpe: 766826.1 jmol-1
zpe.correction: 0.292069 hartree
zpe.thermalcorrener: 0.312122 hartree
zpe.thermalcorrenthalpy: 0.313066 hartree
zpe.thermalcorrgfe: 0.242338 hartree
zpe.sumelectzpe: -1300.350177 hartree
zpe.sumelectthermal: -1300.330124 hartree
zpe.sumelectthermalent: -1300.329179 hartree
zpe.sumelectthermalfe: -1300.399908 hartree
dipole: -3.0468 5.2026 3.5382
dipole: 6.9906
quadrupole: -107.8059 -107.6699 -123.8206
quadrupole: -5.0468 -1.2231 -1.0044
quadrupole: 5.2929 5.4289 -10.7218 -5.0468 -1.2231 -1.0044
hfenergy: -1300.6422459 hartree
pointgroup: C01 [X(C15H17Cl1N2O2)]
dipole: 1.7666247 0.5271005 2.0409435 debye
polarizability: 200.641663|7.4458673|198.2428739|12.798028|23.0099358|186.0261289 unknown
InChI: InChI=1S/C15H17ClN2O2/c1-3-20-15(19)13-11(8-9(2)18-14(13)17)10-6-4-5-7-12(10)16/h4-8,11,18H,3,17H2,1-2H3
charge 0 multiplicity 1
37 atoms
Cl -0.784788 -2.324066 -2.996716
O  -0.78446 2.708894 1.104593
O  -1.652118 1.573549 -0.757615
N  2.509262 0.031498 1.142987
N  1.455135 1.857675 2.175954
C  0.338001 -0.466778 -0.686691
C  0.358269 0.726099 0.273885
C  -0.669999 -1.56764 -0.278354
C  1.720254 -1.096351 -0.827898
C  2.713147 -0.889836 0.078149
C  1.409591 0.887239 1.191734
C  -1.226249 -2.46909 -1.214346
C  -1.050163 -1.753948 1.075555
C  -0.750186 1.647674 0.122931
C  4.075261 -1.542841 0.053915
C  -2.119745 -3.49826 -0.86219
C  -1.93961 -2.778099 1.465335
C  -2.478681 -3.654142 0.495825
C  -1.882063 3.701458 0.942258
C  -1.470975 4.824984 -0.015088
H  0.006346 -0.100511 -1.676641
H  1.888782 -1.774314 -1.668873
H  3.190189 0.058485 1.901592
H  -0.645419 -1.061414 1.822088
H  4.142686 -2.25127 -0.786137
H  4.269062 -2.110346 0.986408
H  4.8855 -0.796479 -0.060164
H  0.657623 2.507458 2.18478
H  2.339488 2.121069 2.60618
H  -2.527561 -4.159338 -1.632564
H  -2.215747 -2.889581 2.51973
H  -3.174435 -4.449263 0.784731
H  -2.773963 3.16935 0.569309
H  -2.063245 4.073247 1.965157
H  -2.274045 5.583659 -0.073636
H  -0.547861 5.323741 0.329502
H  -1.302685 4.422591 -1.027885
