program: Gaussian 09
title: 000193862
version: EM64L-G09RevD.01
frameworkgroup: C1[X(C10H11O10P3)]
method: RPBEPBE
basis: SDD
operation: Freq
keyword: #p
keyword: freq=noraman
keyword: PBEPBE/SDD
title: #p freq=noraman PBEPBE/SDD
converged: YES YES NO NO
title: Mulliken charges:
elementType: P P P O O O O O O O O O O C C C C C C C C C C H H H H H H H H H H H
charge: 1.446374 1.508513 1.495706 -0.534407 -0.812876 -0.784464 -0.651328 -0.534105 -0.651977 -0.542110 -0.643669 -0.762356 -0.563947 0.374362 0.358622 0.399071 -0.546342 -0.390491 -0.361365 -0.520539 -0.414485 -0.238782 -0.230995 0.307418 0.247273 0.260584 0.329927 0.248581 0.244591 0.239174 0.410651 0.452810 0.421756 0.438825
chargesum: 0.00000
title: Mulliken charges with hydrogens summed into heavy atoms:
elementType: P P P O O O O O O O O O O C C C C C C C C C C
charge: 1.446374 1.508513 1.495706 -0.534407 -0.812876 -0.784464 -0.240677 -0.534105 -0.199167 -0.542110 -0.221912 -0.323530 -0.563947 0.374362 0.358622 0.399071 -0.238924 -0.143218 -0.100782 -0.190612 -0.165904 0.005810 0.008179
polarizability: 2.80298884e+02 -3.28167746e+01 2.10408690e+02 -1.39697665e+01 -1.85459434e+01 1.59476088e+02
1716.lowfreq: -5.4014 0.0009 0.0014 0.0019 2.7003 6.9151 27.8615 37.8205 39.7054
frequency: 27.7963 37.8063 39.6886 47.0318 58.3184 65.5506 75.5937 90.2086 117.4881 136.9629 158.4573 164.3901 170.8859 186.0321 192.9184 206.1488 239.6490 253.2707 258.9751 268.0408 276.6067 297.9669 317.3801 327.0295 334.8946 343.7643 363.7314 373.5116 393.0531 402.5915 424.3314 431.7325 456.5677 488.4674 504.9193 513.2870 537.1597 543.9543 553.2224 604.6625 627.8945 653.2929 656.7879 697.5728 731.5222 737.1464 754.7884 761.1934 768.2493 768.9557 782.5336 784.8657 827.0472 836.6921 892.6386 895.4549 942.1738 948.4187 966.7905 980.9614 987.2885 1005.1024 1006.0011 1024.1475 1070.1692 1094.7415 1100.6413 1116.4479 1144.2392 1149.8660 1159.6301 1176.9722 1232.3246 1248.5717 1255.8790 1275.7479 1352.8675 1408.8492 1423.0104 1433.6908 1456.2012 1511.0637 1580.9662 1595.5808 1633.4172 3115.1076 3121.9434 3130.8895 3139.8477 3147.7558 3158.7420 3167.3723 3178.8136 3316.9571 3567.8017 3592.1353
redmass: 8.3738 7.3266 10.5255 7.2088 8.3972 8.4242 8.2481 8.0123 4.7043 8.9402 3.8642 9.5596 5.9772 3.8664 3.4002 7.6217 3.6111 3.2510 5.1201 4.1808 3.7715 5.5372 4.6963 5.6124 7.0248 5.9242 7.8606 8.4067 5.9067 4.2732 7.8888 5.0498 8.0701 2.7053 10.5133 6.6069 2.0189 4.2957 1.9574 8.8999 7.3858 3.5771 6.8563 10.5407 1.7185 11.4099 5.6440 8.7702 6.2098 1.6044 2.4463 2.8669 13.8819 1.4656 3.4194 1.6640 1.6089 3.2447 1.3672 1.5963 1.3988 1.3337 1.3041 2.2784 2.7195 3.1274 7.3042 1.8784 1.9258 1.2478 1.6450 1.0825 2.5212 1.4652 1.2214 1.8310 1.7269 5.6055 4.7879 2.8593 2.2235 3.6741 7.5648 5.5184 6.7783 1.0676 1.0886 1.0885 1.0898 1.0939 1.0935 1.0999 1.0962 1.0680 1.0663 1.0665
irintensity: 0.6202 0.2904 0.5614 1.1119 0.5771 1.5324 1.9949 9.7805 24.5397 7.8194 20.1091 13.1300 15.6345 0.1507 38.7107 11.5994 31.4842 35.7186 14.5122 18.5623 31.1749 21.7766 18.7560 6.6288 19.8359 1.7551 39.2917 17.8781 90.0159 7.8312 59.6212 17.8335 45.9215 22.0394 61.1406 2.3972 70.3452 8.2886 13.9889 18.2626 13.0168 14.0835 81.3462 103.8104 53.8625 119.7714 53.5174 193.0514 155.6513 43.7977 17.2925 823.7005 303.1116 107.3799 37.5556 9.9263 39.1447 40.6338 6.3745 65.4735 20.6860 19.6454 17.2315 2.3934 35.7744 162.3741 276.8739 17.6684 66.7377 8.5282 42.6490 0.3380 43.0068 17.5864 169.2822 5.5618 7.7523 6.7890 5.7376 0.8492 19.5820 31.3614 8.8051 17.2628 11.7807 325.1050 0.4644 1.9443 6.5055 12.3901 2.9962 25.4586 3.1948 717.0875 115.9306 118.4143
temp: 298.150 k
press: 1.00000 atm
elementType: 15 15 15 8 8 8 8 8 8 8 8 8 8 6 6 6 6 6 6 6 6 6 6 1 1 1 1 1 1 1 1 1 1 1
symmnumber: 1
zpe: 564516.6 jmol-1
zpe.correction: 0.215013 hartree
zpe.thermalcorrener: 0.239330 hartree
zpe.thermalcorrenthalpy: 0.240274 hartree
zpe.thermalcorrgfe: 0.160492 hartree
zpe.sumelectzpe: -2161.877587 hartree
zpe.sumelectthermal: -2161.853270 hartree
zpe.sumelectthermalent: -2161.852326 hartree
zpe.sumelectthermalfe: -2161.932108 hartree
dipole: -6.1397 -0.7363 3.9270
dipole: 7.3252
quadrupole: -152.5516 -140.5469 -170.8124
quadrupole: -3.8239 -1.6376 -5.5692
quadrupole: 2.0854 14.0901 -16.1754 -3.8239 -1.6376 -5.5692
hfenergy: -2162.0926002 hartree
pointgroup: C01 [X(C10H11O10P3)]
dipole: -2.0561777 0.9142529 1.8005419 debye
polarizability: 233.1280761|-50.3086708|249.650691|-28.3400451|-8.282231|167.4048939 unknown
InChI: InChI=1S/C10H11O10P3/c11-21(12,13)19-23(16,17)20-22(14,15)18-10-6-5-8-3-1-2-4-9(8)7-10/h1-7,11-12,14,16H
charge 0 multiplicity 1
34 atoms
P  1.667475 -2.748071 -0.847475
P  2.859953 -0.121452 0.528283
P  1.497444 2.28777 -0.993985
O  -0.025967 -2.739075 -1.177346
O  1.907451 -1.061822 -0.563621
O  2.834994 1.364998 -0.413994
O  1.819225 -3.329394 0.768588
O  2.53224 -3.472382 -1.944395
O  1.833483 0.249168 1.820465
O  4.296301 -0.643322 0.879336
O  2.202525 3.830687 -0.918799
O  0.493858 2.09855 0.419495
O  0.748684 1.973814 -2.344222
C  -2.114129 0.260347 -0.374857
C  -2.82001 -0.215849 0.79978
C  -0.948113 -1.871787 -0.512908
C  -1.176876 -0.600521 -1.03073
C  -2.568839 -1.548609 1.269414
C  -1.639053 -2.370296 0.632212
C  -2.337082 1.609954 -0.825561
C  -3.732304 0.667304 1.466731
C  -3.224994 2.449435 -0.140359
C  -3.928484 1.97448 1.013065
H  -0.623399 -0.248895 -1.907664
H  -3.106993 -1.913066 2.151487
H  -1.421212 -3.379946 0.991541
H  -1.833494 1.950879 -1.738993
H  -4.271102 0.303204 2.349445
H  -3.394615 3.471819 -0.495078
H  -4.62323 2.64075 1.534757
H  2.413874 -4.117007 0.866647
H  1.13925 0.951735 1.571935
H  3.056506 3.875436 -0.413406
H  -0.494369 2.151766 0.246807
