program: Gaussian 09
title: 000193850
version: EM64L-G09RevD.01
frameworkgroup: C1[X(C15H22N2O18P2)]
method: RPBEPBE
basis: SDD
operation: Freq
keyword: #p
keyword: freq=noraman
keyword: PBEPBE/SDD
title: #p freq=noraman PBEPBE/SDD
converged: NO YES NO NO
title: Mulliken charges:
elementType: P P O O O O O O O O O O O O O O O O O O N N C C C C C C C C C C C C C C C H H H H H H H H H H H H H H H H H H H H H H
charge: 1.488148 1.459102 -0.245279 -0.529414 -0.207196 -0.524942 -0.435902 -0.475655 -0.526090 -0.410058 -0.472424 -0.850888 -0.564893 -0.426914 -0.266083 -0.173245 -0.339762 -0.658461 -0.692645 -0.639637 -0.225521 -0.377730 -0.036025 -0.145150 -0.260047 -0.037644 -0.121066 -0.085536 -0.110639 -0.357909 -0.104094 -0.162736 0.216720 -0.022027 0.154895 -0.351062 0.232861 0.266380 0.265726 0.326807 0.292248 0.295648 0.289329 0.278210 0.287807 0.257055 0.265504 0.264554 0.367838 0.374276 0.349960 0.410690 0.354313 0.381829 0.372772 0.301579 0.402568 0.423790 0.456068
chargesum: 0.00000
title: Mulliken charges with hydrogens summed into heavy atoms:
elementType: P P O O O O O O O O O O O O O O O O O O N N C C C C C C C C C C C C C C C
charge: 1.488148 1.459102 -0.245279 -0.529414 -0.207196 -0.524942 -0.068064 -0.101379 -0.115399 -0.055745 -0.090595 -0.850888 -0.564893 -0.024346 -0.266083 -0.173245 -0.339762 -0.234671 -0.236577 -0.639637 -0.225521 -0.004957 0.230354 0.120576 0.066759 0.254603 0.174582 0.203793 0.167570 0.186953 0.161411 0.101818 0.216720 0.327933 0.154895 -0.049483 0.232861
polarizability: 3.20809576e+02 -7.41819831e+00 2.92600090e+02 1.22441607e+01 1.93171914e+00 2.26336339e+02
1716.lowfreq: -5.1788 -0.0006 0.0003 0.0013 3.8625 7.4924 19.4314 22.3920 30.5235
frequency: 19.0267 22.3267 30.4545 39.3828 43.3178 46.1938 50.0675 56.4840 62.8682 72.3534 85.2062 95.0671 96.8065 106.6520 123.1183 138.3252 144.5334 148.9612 152.9470 166.7437 168.1137 185.5088 190.5717 198.9369 211.1300 222.4207 231.6422 243.0792 244.5501 249.7674 256.7834 273.1867 283.6110 293.8772 296.0795 300.1926 305.1167 308.8654 321.4724 337.0697 355.6767 360.5358 364.7551 372.3446 381.0877 394.0513 412.7225 420.5165 429.8951 436.1940 453.2935 462.5242 476.4937 480.7623 496.8484 509.1404 526.4951 538.6835 539.3648 546.4173 560.1191 571.1977 595.3046 607.6327 614.5557 634.1460 661.5723 686.6506 689.3766 700.3700 705.8140 709.1572 740.2507 750.1990 752.7283 772.6982 774.8079 780.6800 791.3711 801.9412 807.3463 818.9885 846.9480 862.4461 863.6416 876.3833 910.2267 921.1456 930.1567 946.3727 954.8449 963.1331 973.6553 983.9121 987.4516 996.9648 1007.4719 1015.8060 1018.5869 1031.1948 1032.6862 1043.9280 1049.2423 1055.5679 1065.2546 1070.0879 1073.7534 1083.7606 1092.2104 1120.3633 1130.2506 1183.0586 1185.1819 1195.4596 1202.4135 1208.8157 1238.7698 1238.9044 1251.7683 1255.9873 1259.3345 1271.0577 1275.3860 1289.0085 1289.3791 1297.1833 1299.4674 1303.5937 1308.9576 1314.0012 1318.5468 1330.5456 1338.4444 1344.4438 1352.3766 1361.9891 1363.8783 1373.1498 1379.0598 1381.8671 1384.9254 1387.3178 1393.0366 1427.8057 1461.5957 1571.3221 1632.1141 1651.1836 1702.1231 2559.1760 2654.5979 2978.1241 2987.2276 3028.7704 3042.7082 3062.1745 3062.9752 3068.3194 3069.4300 3079.2590 3089.0472 3105.1703 3175.4642 3218.1724 3448.6120 3475.8010 3512.7791 3517.0060 3538.9885 3588.6104 3615.3499
redmass: 8.1174 9.9018 9.8987 9.1587 9.5279 6.9527 8.9940 9.1641 7.2343 8.4823 9.8816 8.6242 8.1897 10.0515 8.9597 6.3930 7.6565 6.1722 6.9091 6.0609 8.1515 6.9678 7.0983 8.5088 8.5237 5.4111 5.2781 2.8255 4.0530 5.1151 7.5362 6.2686 6.2785 7.7249 5.9128 6.0574 7.8084 4.2372 3.6851 6.6189 10.5695 4.0623 7.6262 10.5846 7.1715 1.4577 6.3019 5.1306 5.4266 3.8116 2.4506 5.8668 2.1328 2.3475 2.9362 4.6048 1.6765 2.8912 3.2981 3.7030 1.8950 4.1911 2.8498 5.5147 2.5259 5.1070 7.2069 4.4179 3.2826 2.9125 6.3546 5.4399 11.0438 6.0708 4.4840 5.0274 2.3251 3.2603 6.8509 4.3711 5.7097 1.8197 3.2199 4.2634 6.1426 4.3052 3.7015 6.7564 5.3214 1.2443 2.9422 2.7783 1.4898 4.8533 4.0889 1.5366 2.4883 3.4438 4.3524 4.3226 3.6089 2.9246 3.8108 3.2705 3.3216 4.3257 8.1865 2.4146 3.5027 2.6214 2.1217 1.3354 1.2112 1.1747 1.3228 3.0994 1.4334 1.6159 1.2570 1.1837 1.3061 1.3535 1.3002 1.3819 1.3548 1.2357 1.2466 1.5348 1.3351 1.2405 1.2882 1.5639 1.3377 1.5531 1.4881 1.2717 1.8289 1.3687 1.2062 1.3843 1.2001 1.2194 1.2122 4.1214 1.0773 4.5581 7.9322 5.5581 10.4385 1.0887 1.0801 1.0807 1.0631 1.0856 1.0869 1.0863 1.0963 1.0884 1.0882 1.0942 1.0863 1.0893 1.0943 1.0971 1.0640 1.0647 1.0650 1.0772 1.0647 1.0665 1.0675
irintensity: 0.4354 2.1364 0.2389 2.0714 0.4824 2.8695 0.5794 4.5982 0.4138 2.0851 0.8042 1.0273 0.5018 3.3004 1.9054 0.8943 1.4795 1.5728 11.8643 7.2845 2.6620 3.0040 11.3410 19.0847 5.4730 25.4886 31.8388 28.2454 34.2553 6.9130 4.3148 18.4983 6.6281 16.0132 81.9369 5.0736 1.5088 15.4530 5.4113 18.0409 90.1258 9.2465 10.3283 64.9706 18.5815 74.4439 102.5147 1.8916 21.9299 6.8958 35.9560 69.5111 128.8229 56.0461 4.6776 26.4625 66.8583 46.7910 16.7551 25.3723 111.8772 44.9789 70.6404 7.4788 84.7755 84.1491 60.4606 0.3799 10.5756 20.8493 42.3582 42.9042 118.2267 29.3260 12.6953 148.5353 113.7334 22.0847 148.1492 29.3076 151.2501 152.1174 49.0007 39.8981 143.5274 27.5721 155.3303 101.6107 37.0504 121.7765 114.8957 7.9071 27.8307 205.5235 30.4134 37.8069 31.0016 130.6438 406.3570 95.1638 87.0374 55.5341 28.8312 66.7169 16.4960 87.1424 98.5663 127.9921 19.3873 15.3814 10.7757 11.1008 24.6117 12.9420 62.1403 59.0730 3.3384 5.6294 99.2382 43.8398 206.9487 16.4255 38.0720 15.5140 6.9012 9.4684 319.3440 92.4987 24.0017 14.6687 1.9701 63.2906 1.6913 16.2157 21.7300 8.6958 44.8886 9.0320 22.5502 2.6985 16.8551 62.6632 30.6886 64.2986 10.9029 144.7821 221.0705 712.0937 287.9033 2514.2433 783.9543 14.0146 27.2264 16.7271 10.2301 3.4027 9.4726 25.5349 18.7703 8.8145 7.5767 8.1191 25.0528 5.8922 48.8660 59.9944 23.1916 79.5101 49.9112 27.3403 44.4238
temp: 298.150 k
press: 1.00000 atm
elementType: 15 15 8 8 8 8 8 8 8 8 8 8 8 8 8 8 8 8 8 8 7 7 6 6 6 6 6 6 6 6 6 6 6 6 6 6 6 1 1 1 1 1 1 1 1 1 1 1 1 1 1 1 1 1 1 1 1 1 1
symmnumber: 1
zpe: 1083315.4 jmol-1
zpe.correction: 0.412613 hartree
zpe.thermalcorrener: 0.449876 hartree
zpe.thermalcorrenthalpy: 0.450820 hartree
zpe.thermalcorrgfe: 0.342850 hartree
zpe.sumelectzpe: -2727.909110 hartree
zpe.sumelectthermal: -2727.871847 hartree
zpe.sumelectthermalent: -2727.870903 hartree
zpe.sumelectthermalfe: -2727.978873 hartree
dipole: 2.4370 -6.7868 2.0460
dipole: 7.4957
quadrupole: -198.1709 -238.7136 -246.4102
quadrupole: 8.8814 -9.5662 -7.1447
quadrupole: 29.5940 -10.9487 -18.6453 8.8814 -9.5662 -7.1447
hfenergy: -2728.3217232 hartree
pointgroup: C01 [X(C15H22N2O18P2)]
dipole: -2.0852071 -1.2618731 -1.66024 debye
polarizability: 322.1306622|-7.9760509|277.4363092|-0.8182374|28.5086418|240.1790339 unknown
InChI: InChI=1S/C15H22N2O18P2/c18-5-1-2-17(15(26)16-5)12-7(20)6(19)4(32-12)3-31-37(30,35-36(27,28)29)34-10-8(21)11(13(23)24)33-14(25)9(10)22/h1-2,4,6-12,14,16,19-23,25,27-28H,3H2
charge 0 multiplicity 1
59 atoms
P  0.529365 -0.940803 1.148806
P  1.281305 2.310471 1.1901
O  -3.09154 -0.841995 0.588307
O  1.950897 -1.871418 0.797221
O  5.109729 -1.738864 -1.957454
O  -0.157232 -0.872234 -0.438761
O  -4.154198 0.177697 -2.68985
O  -5.748391 -0.518343 -0.706307
O  3.79212 0.06597 0.130791
O  3.071327 -4.393036 -0.247075
O  3.704026 -3.53366 -2.77283
O  1.295107 0.552663 1.466494
O  -0.321299 -1.513705 2.345987
O  3.820809 1.602178 -2.562586
O  -4.757398 3.047778 1.103751
O  6.001641 0.775104 -2.657819
O  -0.831457 3.934928 3.428879
O  1.457319 2.979462 2.710054
O  2.787926 2.431992 0.483553
O  -0.011692 2.733194 0.36025
N  -3.424461 1.204772 1.797535
N  -2.851638 3.425883 2.388761
C  -2.637613 -0.512731 -0.798068
C  -3.670501 0.518423 -1.36984
C  -4.81481 0.547886 -0.307896
C  -4.117284 0.105594 1.00057
C  2.537342 -1.976254 -0.564491
C  3.095864 -0.592951 -0.997152
C  3.627356 -3.063625 -0.432086
C  -1.231287 0.08637 -0.842189
C  4.073341 -0.727928 -2.183696
C  4.549317 -3.048037 -1.675622
C  -3.760502 2.581773 1.720414
C  -2.403065 0.758962 2.640267
C  4.788884 0.592625 -2.483438
C  -1.558476 1.619019 3.296985
C  -1.688535 3.044399 3.079169
H  -2.680186 -1.459512 -1.360991
H  -3.219847 1.522357 -1.460053
H  -5.31014 1.526045 -0.234983
H  -4.802052 -0.43349 1.675537
H  1.763514 -2.288315 -1.28735
H  2.260398 0.059938 -1.310795
H  4.235398 -2.866604 0.46509
H  -1.136326 1.027772 -0.267429
H  -0.99148 0.307074 -1.898181
H  3.470328 -1.004619 -3.074504
H  5.428234 -3.696146 -1.519956
H  -4.907305 -0.462831 -2.549294
H  -6.676494 -0.255738 -0.495572
H  -2.254013 -0.322927 2.6861
H  3.507734 -0.381109 0.975306
H  2.72116 -4.690031 -1.129516
H  4.263515 -3.795018 -3.545755
H  -3.002358 4.43002 2.241284
H  -0.749672 1.23546 3.918484
H  4.24604 2.488804 -2.709151
H  0.60739 3.439034 3.119717
H  3.293662 1.536176 0.29858
