program: Gaussian 09
title: 000193830
version: EM64L-G09RevD.01
frameworkgroup: C1[X(C3H4BrO6P)]
method: RPBEPBE
basis: SDD
operation: Freq
keyword: #p
keyword: freq=noraman
keyword: PBEPBE/SDD
title: #p freq=noraman PBEPBE/SDD
converged: YES YES NO NO
title: Mulliken charges:
elementType: Br P O O O O O O C C C H H H H
charge: 0.108947 1.366563 -0.505280 -0.658175 -0.687358 -0.563503 -0.383880 -0.319565 0.373520 0.219593 -0.494361 0.295808 0.414756 0.434112 0.398821
chargesum: 0.00000
title: Mulliken charges with hydrogens summed into heavy atoms:
elementType: Br P O O O O O O C C C
charge: 0.108947 1.366563 -0.505280 -0.243418 -0.253246 -0.563503 0.014941 -0.319565 0.373520 0.219593 -0.198553
polarizability: 1.50829278e+02 -8.77924776e+00 8.57575500e+01 8.61080698e+00 1.60500302e+00 5.51982711e+01
1716.lowfreq: -7.2416 -4.4682 -0.0018 0.0007 0.0013 6.0669 27.9882 59.7143 84.5636
frequency: 27.7341 59.6997 84.5589 112.2690 159.0285 182.2573 188.3013 213.9819 241.9870 279.8171 310.2248 326.9115 332.6016 365.6511 400.5417 487.5877 552.6920 605.3598 610.8654 685.8605 707.2779 715.6617 743.7495 781.7953 828.5251 845.0097 984.9803 1050.5462 1120.2271 1123.8424 1167.0736 1251.5837 1375.2319 1565.7633 1602.6957 3189.4704 3276.0009 3512.0849 3577.1382
redmass: 10.6885 10.8280 11.8933 8.3815 5.4192 10.2784 5.5485 5.4788 2.2627 9.6253 3.4687 5.0231 3.5559 9.8548 7.2250 6.7321 6.7777 1.4962 4.7406 4.7134 11.5503 1.1606 8.1889 14.0858 1.4364 4.5980 1.5557 3.9282 2.5479 3.1768 1.2016 1.2932 3.1936 9.9704 8.4063 1.0919 1.0653 1.0643 1.0660
irintensity: 0.9487 6.6936 0.7157 1.8858 21.4472 10.1552 8.6615 19.7788 44.2694 5.5700 12.3913 31.1027 40.1123 20.3477 79.4748 33.1730 9.7014 130.8036 11.6452 36.6956 208.8424 203.3505 41.6048 181.2776 57.7049 135.9194 97.5388 360.2708 45.7903 108.4771 451.5173 0.8722 60.4500 75.5077 339.1512 10.5364 339.7654 61.1550 103.0946
temp: 298.150 k
press: 1.00000 atm
elementType: 35 15 8 8 8 8 8 8 6 6 6 1 1 1 1
symmnumber: 1
zpe: 213213.9 jmol-1
zpe.correction: 0.081209 hartree
zpe.thermalcorrener: 0.093870 hartree
zpe.thermalcorrenthalpy: 0.094814 hartree
zpe.thermalcorrgfe: 0.040309 hartree
zpe.sumelectzpe: -921.863975 hartree
zpe.sumelectthermal: -921.851314 hartree
zpe.sumelectthermalent: -921.850370 hartree
zpe.sumelectthermalfe: -921.904875 hartree
dipole: 2.6599 2.4387 -2.6005
dipole: 4.4480
quadrupole: -79.1392 -73.3333 -84.3939
quadrupole: 1.0530 9.6332 4.6552
quadrupole: -0.1837 5.6222 -5.4384 1.0530 9.6332 4.6552
hfenergy: -921.9451841 hartree
pointgroup: C01 [X(C3H4Br1O6P1)]
dipole: 1.3347849 -0.3322441 1.081854 debye
dipolederiv: -0.6695222 -0.1584811 0.2661182 0.1075823 0.0710854 -0.0325898 0.2360817 0.0654073 -0.008991 2.8319031 -0.0834374 -0.2246743 -0.0626646 1.723776 0.0829801 0.2724696 -0.0226015 1.7231772 -1.8751228 -0.0848809 0.2154686 0.1232336 -0.4278901 -0.0209103 0.1143777 0.032144 -0.5278913 -0.9910952 0.1814629 0.1129849 0.2923323 -0.7073591 -0.2629884 0.208137 -0.309784 -0.5611128 -0.8865592 -0.0195069 0.0290246 0.015214 -0.8787236 0.1159874 -0.0105722 0.2417786 -0.8286427 -0.7579032 0.0188337 0.0209977 -0.0793019 -0.540302 0.0131182 -0.207574 -0.0215862 -0.5942971 -0.8741244 0.5445844 -0.0721706 0.3531978 -0.5394041 -0.0177878 0.0413987 -0.1285402 -0.3563154 -1.1197066 -0.0713381 0.21342 -0.3873536 -0.7681448 0.2920418 0.3087509 0.1808879 -0.4896662 0.7421958 -0.2191288 -0.0591022 -0.7163557 -0.4928847 0.3190644 -0.2266597 0.2021957 0.011936 1.2867137 -0.3087033 -0.1694392 0.4741554 1.4672962 -0.5608738 -0.3911794 -0.2306072 0.5029079 0.8913617 0.2952356 -0.5081589 -0.1443024 0.0771008 -0.0407494 -0.3509881 -0.2193561 -0.005842 -0.0255327 0.0548983 0.0692063 0.0661209 0.0849491 0.0226955 0.0481593 0.009294 0.170204 0.4279366 0.0086725 0.0313862 -0.0123912 0.3123148 0.0780831 -0.0365911 0.1119275 0.2140193 0.7028112 -0.0291346 0.0039307 0.0316353 0.3922507 -0.0502142 -0.0505795 0.0074999 0.3822104 0.3166444 -0.1290761 0.0710079 -0.0611022 0.2259355 0.0621431 0.0447692 0.0813404 0.3683037 unknown
polarizability: 141.3245948|7.0266631|82.3655063|-28.2173053|-13.6646426|68.0949977 unknown
InChI: InChI=1S/C3H4BrO6P/c4-1-2(3(5)6)10-11(7,8)9/h1,5,7-8H
charge 0 multiplicity 1
15 atoms
Br 3.486687 0.970355 -1.326498
P  -1.96376 0.358426 -0.288666
O  -0.387072 0.963184 0.326564
O  -2.976328 1.648015 0.143413
O  -2.410221 -0.773144 0.906833
O  -1.932196 -0.023178 -1.818318
O  2.267894 -1.53702 -0.00998
O  0.098654 -1.741678 0.751586
C  0.833648 0.404497 -0.109044
C  1.015574 -1.027351 0.25006
C  1.685481 1.263989 -0.745481
H  1.337526 2.280529 -0.949566
H  -3.350238 1.581824 1.06019
H  -1.646633 -1.412163 1.076848
H  2.296382 -2.501986 0.23586
