program: Gaussian 09
title: 000193828
version: EM64L-G09RevD.01
frameworkgroup: C1[X(C8H12N4O3)]
method: RPBEPBE
basis: SDD
operation: Freq
keyword: #p
keyword: freq=noraman
keyword: PBEPBE/SDD
title: #p freq=noraman PBEPBE/SDD
converged: YES YES NO NO
title: Mulliken charges:
elementType: O O O N N N N C C C C C C C C H H H H H H H H H H H H
charge: -0.400362 -0.292625 -0.279451 -0.207523 -0.441626 -0.174899 -0.222118 0.150055 0.298563 -0.110015 0.170652 0.222717 -0.647115 -0.644556 -0.601532 0.236287 0.332987 0.291092 0.234710 0.211807 0.236023 0.235732 0.295885 0.272309 0.245573 0.246142 0.341287
chargesum: 0.00000
title: Mulliken charges with hydrogens summed into heavy atoms:
elementType: O O O N N N N C C C C C C C C
charge: -0.059075 -0.292625 -0.279451 -0.207523 -0.108639 -0.174899 -0.222118 0.150055 0.298563 0.126273 0.170652 0.222717 0.090495 0.123083 0.162492
polarizability: 1.64398673e+02 1.28773709e+00 1.46105055e+02 2.45639668e+00 2.08075360e+00 7.54892168e+01
1716.lowfreq: -8.8820 -6.1438 0.0004 0.0005 0.0006 1.0021 65.4865 78.1463 102.6411
frequency: 65.4835 78.1447 102.6349 108.6329 121.7059 150.2539 155.5824 171.1330 180.7599 201.5238 268.1266 288.8032 299.3653 327.1528 329.3772 345.8548 379.9463 389.8232 402.5162 438.8126 482.5172 501.4250 563.3113 611.6494 634.4701 687.7341 693.7555 712.1431 756.7715 838.6449 912.4452 940.9119 988.1453 992.6219 1029.9170 1034.3653 1123.9891 1127.1016 1130.4093 1173.1870 1184.6260 1211.2051 1226.9664 1236.3829 1240.0233 1285.6143 1307.2345 1353.8180 1388.2450 1398.9662 1416.2799 1427.1103 1456.2563 1474.6100 1476.3893 1477.5242 1482.4602 1491.1440 1493.3293 1539.4789 1589.9369 1640.4613 1661.0338 2935.9967 2981.5176 2990.2612 3008.2581 3057.3404 3066.4497 3099.7783 3114.1574 3118.8270 3134.2540 3514.3564 3634.5509
redmass: 4.8143 3.5400 4.4733 1.1167 3.4208 1.3962 2.6072 2.2710 1.3555 3.6817 2.8499 2.8442 2.6021 1.9915 3.2447 3.2326 4.2578 3.5804 5.3093 2.9553 5.4275 4.1676 4.0827 7.2530 5.4286 10.6776 5.6495 10.5340 5.2131 4.0955 4.2436 4.4337 2.9920 3.4681 2.8039 2.9731 1.2817 1.2891 1.3044 2.1293 2.1598 2.4060 1.7269 3.7943 2.1340 5.3571 2.4761 1.8174 1.2010 2.1061 1.2382 1.2118 1.4811 1.0760 1.0872 1.0588 1.0866 1.0976 1.0451 6.3965 7.2790 9.8107 9.7840 1.0486 1.0350 1.0867 1.0327 1.0845 1.1033 1.1023 1.1018 1.0976 1.1021 1.0649 1.0807
irintensity: 0.2681 0.8954 0.7964 1.7638 10.7955 5.0007 0.6562 1.9576 3.2636 3.0287 15.7502 11.2209 7.1506 36.7644 9.9004 11.7999 17.9721 32.0056 29.2599 75.0660 2.0968 22.4444 14.7985 9.4079 19.8181 2.8312 37.3721 18.8778 5.0749 128.8430 158.6285 25.6234 131.5748 33.7036 51.8877 22.4609 17.4302 0.2502 0.1215 18.8119 64.8833 17.9245 5.1145 12.0250 8.7515 65.0211 108.5706 32.7952 119.1963 55.5377 23.0737 26.1217 58.2589 13.5093 15.5495 6.4732 32.3110 31.4717 19.0880 517.3339 211.5890 128.7960 572.0944 104.9081 53.5333 72.4115 32.1444 27.7205 25.6258 19.5991 1.6481 0.5928 0.6964 4.5695 76.1720
temp: 298.150 k
press: 1.00000 atm
elementType: 8 8 8 7 7 7 7 6 6 6 6 6 6 6 6 1 1 1 1 1 1 1 1 1 1 1 1
symmnumber: 1
zpe: 549420.8 jmol-1
zpe.correction: 0.209263 hartree
zpe.thermalcorrener: 0.224487 hartree
zpe.thermalcorrenthalpy: 0.225431 hartree
zpe.thermalcorrgfe: 0.167730 hartree
zpe.sumelectzpe: -755.608757 hartree
zpe.sumelectthermal: -755.593533 hartree
zpe.sumelectthermalent: -755.592589 hartree
zpe.sumelectthermalfe: -755.650290 hartree
dipole: -2.1334 -3.9087 -1.0402
dipole: 4.5729
quadrupole: -101.3144 -85.2697 -84.8709
quadrupole: 1.9311 3.1105 0.2292
quadrupole: -10.8294 5.2153 5.6141 1.9311 3.1105 0.2292
hfenergy: -755.8180206 hartree
pointgroup: C01 [X(C8H12N4O3)]
dipole: 0.8166515 -1.5393751 0.4475242 debye
polarizability: 164.3819986|-1.5569129|145.9736655|1.7991635|-4.1354145|75.6372804 unknown
InChI: InChI=1S/C8H12N4O3/c1-10-4-5(9-7(10)14)11(2)8(15)12(3)6(4)13/h7,9,14H,1-3H3
charge 0 multiplicity 1
27 atoms
O  3.538125 -0.987398 -0.97904
O  -0.319807 2.717823 -0.326266
O  -3.296949 -0.940758 -0.033705
N  1.984863 0.653607 -0.008443
N  1.475546 -1.571651 0.226444
N  -0.994036 -1.385064 0.097806
N  -1.799117 0.865863 -0.137717
C  0.567696 0.490411 0.019018
C  0.284119 -0.864589 0.137776
C  2.631779 -0.651814 0.128458
C  -0.466648 1.462492 -0.166127
C  -2.109287 -0.498791 -0.025738
C  2.663341 1.866648 0.470723
C  -1.245985 -2.832213 0.201211
C  -2.957144 1.778519 -0.27263
H  3.314866 -0.734339 0.99756
H  1.59118 -2.574497 0.340804
H  2.075935 2.740496 0.147433
H  3.67191 1.925254 0.028282
H  2.75293 1.891308 1.578577
H  -0.887821 -3.228518 1.169115
H  -0.760535 -3.375652 -0.630017
H  -2.335561 -2.974088 0.138389
H  -2.555229 2.799569 -0.348881
H  -3.618147 1.683927 0.604608
H  -3.539104 1.525535 -1.174335
H  3.091383 -0.726479 -1.828705
