program: Gaussian 09
title: 000193811
version: EM64L-G09RevD.01
frameworkgroup: C1[X(C12H15NO5)]
method: RPBEPBE
basis: SDD
operation: Freq
keyword: #p
keyword: freq=noraman
keyword: PBEPBE/SDD
title: #p freq=noraman PBEPBE/SDD
converged: YES YES NO NO
title: Mulliken charges:
elementType: O O O O O N C C C C C C C C C C C C H H H H H H H H H H H H H H H
charge: -0.287086 -0.431364 -0.437709 -0.216389 -0.304594 -0.413954 -0.146740 -0.427736 -0.313713 0.139905 0.308557 -0.480257 0.476156 -0.369760 -0.390984 -0.224623 -0.225333 -0.232406 0.298020 0.222714 0.276561 0.194078 0.236615 0.367803 0.245791 0.221339 0.269196 0.232087 0.333581 0.229062 0.226948 0.229857 0.394377
chargesum: 0.00000
title: Mulliken charges with hydrogens summed into heavy atoms:
elementType: O O O O O N C C C C C C C C C C C C
charge: -0.287086 -0.097783 -0.043332 -0.216389 -0.304594 -0.046151 0.151280 0.071539 0.116980 0.139905 0.308557 -0.013127 0.476156 -0.100564 -0.158897 0.004439 0.001615 -0.002549
polarizability: 1.77793833e+02 -1.27931675e+01 1.42699884e+02 1.78751259e+01 1.51252178e+01 1.26611835e+02
1716.lowfreq: -6.1913 -4.4431 -0.0006 -0.0006 -0.0004 11.5452 15.7965 17.6608 33.9182
frequency: 15.4622 17.3855 33.8274 45.3463 52.5212 81.3607 84.2988 91.3376 107.5438 150.2745 190.4001 214.3634 250.3429 270.3024 303.7495 324.6183 343.5358 356.2534 400.2613 404.0047 474.4723 498.6179 530.1931 566.3918 590.5845 603.0089 617.9271 636.1132 655.8731 700.1226 705.4167 725.0380 757.8427 784.9172 815.4960 817.8139 859.0390 880.6941 907.2839 935.0357 965.7157 980.3664 982.2052 989.0215 994.7393 1001.2826 1027.1933 1032.1994 1058.7747 1086.2758 1091.5023 1129.5412 1173.7482 1181.3927 1188.9816 1202.0524 1217.0084 1222.0459 1239.1303 1280.6330 1291.2034 1313.7913 1330.2624 1331.4868 1348.8239 1356.0662 1384.3710 1385.8825 1443.2816 1461.7696 1462.3810 1473.6590 1481.4712 1484.9097 1595.0117 1614.8933 1646.6775 1671.7629 2945.4660 2997.5154 3008.4361 3036.1219 3073.7072 3092.4225 3110.0883 3119.7971 3128.4441 3139.6163 3150.5542 3165.2380 3527.6490 3557.4995 3567.5516
redmass: 6.1828 4.5758 4.8244 8.2230 6.7375 6.6056 3.0662 3.2495 5.4727 5.8228 4.9924 4.3291 5.4874 5.6176 4.5853 1.7350 1.9483 2.9578 3.3688 2.8256 3.7028 3.3437 3.9609 3.9649 1.2124 3.3332 6.1773 1.6071 4.7283 5.3715 2.1113 4.3686 2.2333 1.6563 3.6119 2.2975 1.2481 4.9204 2.9913 1.4925 2.3657 3.8505 1.4644 4.6689 3.9417 1.3380 2.1923 1.9414 3.2468 1.6098 1.5179 2.3575 1.0543 1.7294 1.1265 2.0074 1.3750 2.8522 1.1576 1.3830 1.3054 1.5735 1.2580 1.4183 1.2757 1.3048 1.2868 8.0113 2.1813 1.0982 1.1496 1.9100 1.0988 2.2749 6.1117 6.0789 9.3943 9.1541 1.0699 1.0736 1.0715 1.0586 1.0939 1.1000 1.1073 1.0867 1.0872 1.0919 1.0965 1.1016 1.0644 1.0662 1.0778
irintensity: 0.3579 0.1126 0.5128 4.5495 0.5454 4.8095 4.8810 2.9729 2.2163 1.3315 1.1079 2.2942 22.6992 3.3811 2.2960 56.2771 57.3071 41.4962 11.1616 0.0840 18.2539 11.0718 53.7175 29.1704 63.3204 0.6507 0.5668 166.6666 6.2286 36.7402 80.1256 11.0358 66.6126 9.3086 8.7952 1.8592 0.2004 40.9490 48.6784 4.9957 78.6002 91.1373 4.0108 28.4824 140.6430 2.0539 13.8623 138.5535 28.3986 116.7281 15.8806 45.7610 0.0686 6.6510 8.6056 180.5611 18.5047 22.5431 9.1836 13.3333 34.2590 43.0935 1.3287 14.1754 10.3893 3.4901 21.4910 0.6294 9.9228 6.7497 22.5045 508.6054 13.4337 28.9904 1.9919 0.4735 211.4709 216.5005 66.1091 9.6367 23.8667 35.4744 2.5230 27.9739 5.6738 5.8662 1.7167 15.8723 28.5822 21.5619 36.5811 7.4254 84.0368
temp: 298.150 k
press: 1.00000 atm
elementType: 8 8 8 8 8 7 6 6 6 6 6 6 6 6 6 6 6 6 1 1 1 1 1 1 1 1 1 1 1 1 1 1 1
symmnumber: 1
zpe: 679124.2 jmol-1
zpe.correction: 0.258665 hartree
zpe.thermalcorrener: 0.276827 hartree
zpe.thermalcorrenthalpy: 0.277771 hartree
zpe.thermalcorrgfe: 0.208385 hartree
zpe.sumelectzpe: -895.801754 hartree
zpe.sumelectthermal: -895.783592 hartree
zpe.sumelectthermalent: -895.782647 hartree
zpe.sumelectthermalfe: -895.852034 hartree
dipole: 0.5863 -1.4106 -2.0712
dipole: 2.5735
quadrupole: -96.1002 -103.0229 -103.8969
quadrupole: -1.3642 -3.0139 7.9638
quadrupole: 4.9065 -2.0162 -2.8902 -1.3642 -3.0139 7.9638
hfenergy: -896.0604186 hartree
pointgroup: C01 [X(C12H15N1O5)]
dipole: 0.1916176 0.9228855 0.3697812 debye
polarizability: 176.619101|2.1042468|151.8789875|-23.1975759|-2.6458246|118.6074635 unknown
InChI: InChI=1S/C12H15NO5/c14-7-6-10(11(15)16)13-12(17)18-8-9-4-2-1-3-5-9/h1-5,10,13-15H,6-8H2
charge 0 multiplicity 1
33 atoms
O  -0.664254 1.487514 -0.814236
O  2.538383 -2.601862 2.044583
O  3.657039 2.092065 0.367735
O  5.144537 0.511981 -0.464555
O  0.213551 -0.377126 -1.97965
N  1.501225 0.884861 -0.484552
C  2.728211 0.120363 -0.728431
C  2.722491 -1.293398 -0.063902
C  2.624991 -1.251485 1.471795
C  3.969443 0.892577 -0.290747
C  0.345027 0.574155 -1.160716
C  -2.017644 1.207833 -1.409849
C  -2.860397 0.353641 -0.488428
C  -2.756769 -1.061582 -0.527267
C  -3.759894 0.956086 0.426972
C  -3.535292 -1.85705 0.34196
C  -4.541543 0.161115 1.294859
C  -4.429433 -1.248215 1.254192
H  2.828102 -0.052133 -1.818559
H  3.651011 -1.81212 -0.372805
H  1.863766 -1.852111 -0.474511
H  3.485218 -0.696883 1.90744
H  1.692261 -0.758568 1.790319
H  1.529648 1.706792 0.120651
H  -1.858426 0.722752 -2.388275
H  -2.44298 2.215147 -1.541074
H  -2.057124 -1.526098 -1.23154
H  -3.844977 2.049423 0.460985
H  3.352981 -3.109017 1.797321
H  -3.447132 -2.948619 0.307819
H  -5.235182 0.63629 1.99755
H  -5.034465 -1.86681 1.926713
H  4.493831 2.556186 0.639703
