program: Gaussian 09
title: 000193800
version: EM64L-G09RevD.01
frameworkgroup: C1[X(C13H8BrClN2OS)]
method: RPBEPBE
basis: SDD
operation: Freq
keyword: #p
keyword: freq=noraman
keyword: PBEPBE/SDD
title: #p freq=noraman PBEPBE/SDD
converged: YES YES NO NO
title: Mulliken charges:
elementType: Br Cl S O N N C C C C C C C C C C C C C H H H H H H H H
charge: 0.069165 -0.034437 0.332194 -0.199071 -0.351374 0.086501 0.309700 0.330417 0.373298 -0.536764 -0.492747 -0.098113 -0.354004 -0.349998 -0.005997 -0.587795 -0.227417 -0.230494 -0.218495 0.336914 0.259794 0.269017 0.281048 0.280019 0.264934 0.246945 0.246762
chargesum: 0.00000
title: Mulliken charges with hydrogens summed into heavy atoms:
elementType: Br Cl S O N N C C C C C C C C C C C C C
charge: 0.069165 -0.034437 0.332194 -0.199071 -0.014461 0.086501 0.309700 0.330417 0.373298 -0.007954 -0.492747 0.182935 -0.354004 -0.069978 -0.005997 -0.587795 0.037517 0.016451 0.028267
polarizability: 2.71297570e+02 4.22908167e+00 2.58032144e+02 7.09730312e+00 7.45152471e+00 1.27686249e+02
1716.lowfreq: -5.6162 -0.0027 -0.0014 -0.0009 2.4276 5.8883 28.3298 46.0612 58.9125
frequency: 28.3022 46.0544 58.9017 61.7278 104.7168 117.4009 143.0419 162.2515 175.3983 209.1041 227.2593 265.4430 298.6067 329.1286 340.1516 358.6649 381.0755 404.6810 412.6945 459.3272 464.9768 490.5453 517.8630 573.9790 581.8149 620.1861 623.5831 630.5231 665.0926 684.6824 711.2268 734.4490 744.0678 767.6225 781.6101 839.7932 848.2692 879.0232 896.3546 963.9915 965.8569 975.7759 997.2734 1020.5632 1036.4453 1048.8606 1115.4105 1130.1575 1176.8526 1184.8514 1231.0530 1243.3438 1262.4371 1290.8889 1309.9251 1350.1895 1362.0118 1421.0290 1445.5498 1459.0906 1499.0914 1525.0240 1547.9089 1562.9480 1579.5233 1599.5498 1608.4936 3010.8922 3126.6386 3144.7853 3154.3677 3168.9439 3180.8824 3191.5990 3537.7286
redmass: 11.3294 7.9440 11.8137 8.6608 6.5651 7.2735 7.9800 8.6049 8.2685 7.6077 8.4370 7.5151 7.2127 5.8126 7.5151 8.5386 7.7760 8.6978 7.1403 3.3638 3.2847 4.7904 4.6777 2.2755 4.8832 2.9497 4.9078 4.2443 6.2709 7.1338 5.6244 4.0375 7.2134 1.5992 3.6230 7.5198 1.4228 1.3604 6.1126 1.4274 5.3490 2.1480 1.3436 6.5676 3.0738 2.3563 3.9680 1.8518 1.0611 1.7253 1.4120 2.8486 1.5038 1.6428 2.2117 2.0964 6.3786 2.2462 1.1932 2.3102 4.5217 2.5237 6.6334 6.1882 9.3535 6.8791 9.6703 1.0637 1.1019 1.0865 1.0908 1.0952 1.1005 1.0951 1.0779
irintensity: 0.7286 0.5550 0.4518 3.8185 5.0355 0.1367 0.1299 1.4310 1.7726 1.3195 0.2898 2.8080 2.3226 1.6613 6.2791 0.3786 13.0860 6.9015 0.3985 14.2684 2.1169 13.7909 0.3484 22.0989 34.6563 41.0059 3.6746 15.7399 32.1836 10.7758 23.0736 5.2856 33.3128 119.9072 13.1657 2.8039 19.1966 1.7334 62.7321 0.4028 13.9589 16.8141 0.3448 42.4644 14.6341 6.2898 21.8667 4.0203 0.7794 30.9605 26.8188 41.9159 7.7179 26.4355 18.6081 7.2018 4.3322 26.9527 27.4777 30.3032 280.2730 136.3102 120.6356 10.0648 121.6893 11.7137 744.1568 19.9907 5.5994 0.2933 4.9938 4.9052 10.5941 1.3803 77.8760
temp: 298.150 k
press: 1.00000 atm
elementType: 35 17 16 8 7 7 6 6 6 6 6 6 6 6 6 6 6 6 6 1 1 1 1 1 1 1 1
symmnumber: 1
zpe: 472940.8 jmol-1
zpe.correction: 0.180134 hartree
zpe.thermalcorrener: 0.196788 hartree
zpe.thermalcorrenthalpy: 0.197732 hartree
zpe.thermalcorrgfe: 0.133591 hartree
zpe.sumelectzpe: -1555.144808 hartree
zpe.sumelectthermal: -1555.128154 hartree
zpe.sumelectthermalent: -1555.127210 hartree
zpe.sumelectthermalfe: -1555.191351 hartree
dipole: 5.1178 -6.9573 0.7619
dipole: 8.6704
quadrupole: -124.2172 -149.5044 -133.0196
quadrupole: -5.0803 -2.0547 17.9829
quadrupole: 11.3632 -13.9240 2.5608 -5.0803 -2.0547 17.9829
hfenergy: -1555.3249421 hartree
pointgroup: C01 [X(C13H8Br1Cl1N2O1S1)]
dipole: 3.3481196 0.3733544 -0.5357564 debye
polarizability: 258.5378183|-2.3137414|257.8137777|-11.709016|40.9461867|140.6643665 unknown
InChI: InChI=1S/C13H8BrClN2OS/c14-10-5-8-12(7-3-1-2-4-9(7)15)16-6-11(18)17-13(8)19-10/h1-5,16H,6H2
charge 0 multiplicity 1
27 atoms
Br -1.511235 4.559166 0.695985
Cl 2.183711 -1.280816 -2.567483
S  -3.105142 1.745652 0.739533
O  -3.011456 -3.322656 0.432554
N  -0.246486 -1.820566 -0.631523
N  -2.912105 -0.972508 0.565376
C  0.137914 -0.594587 -0.157094
C  -0.810131 0.417675 0.141837
C  1.598627 -0.392012 0.067478
C  -1.573596 -2.120984 -1.169455
C  -2.222131 0.141025 0.413377
C  -0.472381 1.834268 0.24202
C  2.609728 -0.703028 -0.882509
C  2.029631 0.111192 1.329415
C  -2.581693 -2.208119 0.029764
C  -1.541685 2.640565 0.524806
C  3.979384 -0.529873 -0.604364
C  3.394457 0.286566 1.627174
C  4.373349 -0.037639 0.65959
H  0.438953 -2.579072 -0.612585
H  -1.543246 -3.087958 -1.691704
H  -1.876342 -1.315056 -1.8634
H  0.534211 2.214143 0.059325
H  1.265995 0.344912 2.078518
H  4.723244 -0.768256 -1.369642
H  3.692816 0.668235 2.608357
H  5.437808 0.09363 0.87895
