program: Gaussian 09
title: 000193775
version: EM64L-G09RevD.01
frameworkgroup: C1[X(C20H27N7O3)]
method: RPBEPBE
basis: SDD
operation: Freq
keyword: #p
keyword: freq=noraman
keyword: PBEPBE/SDD
title: #p freq=noraman PBEPBE/SDD
converged: YES YES NO NO
title: Mulliken charges:
elementType: O O O N N N N N N N C C C C C C C C C C C C C C C C C C C C H H H H H H H H H H H H H H H H H H H H H H H H H H H
charge: -0.473204 -0.303575 -0.265140 -0.156190 -0.345444 -0.111927 -0.584568 -0.176489 -0.132555 -0.113381 -0.012001 -0.432558 -0.451964 -0.214765 0.233206 -0.612244 0.236600 -0.092178 -0.249005 0.500962 0.240922 -0.397954 -0.403547 -0.366943 -0.363591 -0.352831 -0.646134 -0.626755 0.305894 -0.539849 0.208878 0.257322 0.270026 0.259455 0.246924 0.223447 0.316735 0.213385 0.228121 0.284650 0.388858 0.306824 0.263490 0.238013 0.227774 0.253756 0.251455 0.260136 0.221867 0.225605 0.317113 0.221632 0.297077 0.226079 0.245053 0.235161 0.218371
chargesum: 0.00000
title: Mulliken charges with hydrogens summed into heavy atoms:
elementType: O O O N N N N N N N C C C C C C C C C C C C C C C C C C C C
charge: -0.084346 -0.303575 -0.265140 -0.156190 -0.028708 -0.111927 -0.014254 -0.176489 -0.132555 -0.113381 0.196877 0.094789 0.054416 0.008682 0.233206 -0.170738 0.236600 -0.092178 0.035644 0.500962 0.240922 -0.159941 -0.175773 -0.113187 -0.112136 -0.092694 0.118451 0.118033 0.305894 0.158736
polarizability: 3.68034483e+02 4.07177380e+01 2.13166219e+02 -1.29708687e+01 -3.18617509e+00 2.49313373e+02
1716.lowfreq: -6.7730 -2.1527 -0.0002 0.0006 0.0008 5.3885 13.9792 19.3317 27.3151
frequency: 13.1953 19.2661 27.2424 37.2097 39.3904 48.2731 61.6304 73.1322 82.4781 88.4643 102.2494 105.5243 115.2012 125.5311 150.6973 156.8558 172.2264 190.8470 208.8815 213.4428 228.5925 240.1467 248.1383 253.6202 266.6898 279.2427 302.1229 304.5753 319.3359 329.0918 336.8453 355.9520 368.7090 382.9072 402.1332 407.3505 414.8918 446.1122 475.3989 500.9803 511.8575 532.7823 546.1600 551.1779 564.3299 593.6491 605.3842 608.1596 631.6752 641.0587 644.0577 658.7916 676.2635 712.3371 716.0474 742.4860 750.3053 781.3789 799.1186 816.5171 824.5827 825.9288 838.4682 850.3316 861.2888 875.0250 899.8503 914.2644 929.1150 933.8626 955.6292 957.5990 973.4738 986.0112 1002.5044 1017.6036 1030.5376 1043.6639 1063.8710 1069.9738 1095.7198 1097.4538 1098.3618 1101.4618 1112.5116 1126.2342 1140.9625 1148.6934 1154.2296 1156.6001 1178.4120 1183.0588 1186.5081 1194.8463 1214.1701 1224.1668 1229.9385 1241.0852 1246.3356 1253.2246 1276.7840 1284.2520 1290.4756 1297.3735 1301.1974 1312.5623 1336.0716 1348.6920 1354.9952 1356.9024 1376.5755 1382.5919 1385.8498 1390.7072 1408.2115 1415.4253 1425.4964 1437.1808 1442.2181 1449.6844 1456.3409 1459.5923 1467.9750 1469.2973 1471.2960 1478.8692 1484.7730 1487.4795 1498.0594 1499.9221 1510.4679 1512.5401 1537.6051 1580.0292 1586.1095 1601.2627 1621.4909 1641.3984 2936.2879 2959.5630 2960.2975 2963.0830 2970.0963 2976.4796 2977.8113 3001.5163 3027.8702 3035.7320 3044.1468 3048.4807 3050.0036 3073.2808 3098.0232 3099.9134 3113.6748 3125.1809 3127.5975 3130.6673 3161.3450 3163.8561 3164.0625 3231.3604 3451.9066 3543.4673 3589.8418
redmass: 5.0618 5.5637 5.3601 4.7020 3.9527 5.3576 4.8144 4.9064 3.1978 3.8140 4.2479 3.0915 2.3591 1.5577 3.0829 1.7353 4.6762 4.0026 4.8212 2.8246 1.9188 2.4123 2.9737 2.6698 2.6916 3.6281 1.2908 3.7451 3.1924 5.1532 2.9186 3.0222 3.5868 4.0334 4.1328 3.3035 3.0181 4.0618 3.0423 4.5572 3.0270 3.9418 3.1465 3.9318 3.5669 1.3043 5.2730 1.4837 5.9643 4.7191 2.9012 9.2536 7.0122 4.5069 4.6533 4.2957 5.1202 7.1308 2.4263 2.6735 1.4351 1.3701 2.2228 3.0104 1.4914 2.7159 4.7473 2.2009 1.4225 1.6588 1.8300 1.3871 3.6738 7.7266 2.6676 3.4996 4.3198 3.3860 1.5066 3.0769 4.3459 1.2321 3.1864 1.3981 1.2641 1.7271 1.2572 1.3708 3.3844 1.3321 1.2234 1.5670 1.8392 2.2884 2.1842 1.3611 4.4074 2.4808 2.0366 1.8642 1.3857 2.1719 1.6743 1.2643 1.6817 1.2647 1.4638 3.5630 1.9315 1.4054 3.1314 2.1098 1.9366 2.1871 1.2590 3.3676 2.4183 1.1709 1.2774 1.1367 1.2198 1.1115 1.0506 1.2640 1.0852 1.3689 1.0456 1.2987 1.0550 2.4202 1.9527 2.0667 5.5304 6.8308 2.2266 4.9760 6.4719 1.5825 1.0836 1.0351 1.0332 1.0848 1.0388 1.0623 1.0679 1.0602 1.0601 1.1008 1.1014 1.1039 1.1006 1.1048 1.1049 1.1020 1.0895 1.0899 1.0984 1.0971 1.0936 1.0924 1.0948 1.0987 1.0451 1.0778 1.0978
irintensity: 0.2027 0.0645 0.4056 3.1049 3.1782 7.4606 2.7669 1.7772 0.1851 1.6327 7.5918 2.7019 2.6269 5.0602 3.6240 0.2809 0.5515 4.1247 3.6063 2.0470 0.9322 2.7382 26.1741 4.7824 1.5225 1.9913 43.9149 0.1744 21.1957 0.2695 0.5191 8.1545 5.2768 3.0989 9.8286 8.3111 0.3828 9.8310 2.8677 1.3170 11.1971 9.6200 14.9933 0.0746 26.0327 73.5535 10.2347 395.3673 4.6301 24.3001 34.9710 3.1905 4.6445 3.9093 5.0459 5.3134 21.1409 7.0411 2.3456 28.2097 15.6683 10.9725 46.9067 28.5053 73.8794 6.8616 4.5463 8.1080 6.4966 3.1792 1.4974 1.4577 26.8788 26.1820 4.8659 144.3813 2.5981 18.2823 7.0626 47.8555 5.2404 0.0811 3.2482 17.4538 0.3828 8.9310 9.6662 0.0878 37.8839 2.6506 30.4689 12.5341 46.9962 91.2310 12.8840 12.8094 130.5926 0.1164 5.4624 66.9274 1.8093 22.2334 35.0693 3.0272 4.7839 2.4387 9.1751 106.4330 25.6461 4.3405 12.8924 25.6599 8.8120 18.0035 21.5742 0.9683 11.9815 12.6965 12.0445 34.1489 2.6157 5.4158 9.5658 2.2256 53.7845 17.6118 4.3915 201.4535 31.4774 81.0361 140.8339 45.4092 43.5645 3.0403 230.3018 599.1049 27.0232 17.6810 92.9006 104.0208 37.1814 35.6278 402.8215 97.5786 595.2327 17.7756 24.1256 38.9355 27.3023 41.5371 16.7517 14.0465 6.0796 8.9472 18.3209 23.4392 10.8423 0.8993 12.6901 14.3683 3.1276 0.3520 13.4029 15.6225 9.1995
temp: 298.150 k
press: 1.00000 atm
elementType: 8 8 8 7 7 7 7 7 7 7 6 6 6 6 6 6 6 6 6 6 6 6 6 6 6 6 6 6 6 6 1 1 1 1 1 1 1 1 1 1 1 1 1 1 1 1 1 1 1 1 1 1 1 1 1 1 1
symmnumber: 1
zpe: 1213485.7 jmol-1
zpe.correction: 0.462192 hartree
zpe.thermalcorrener: 0.491715 hartree
zpe.thermalcorrenthalpy: 0.492659 hartree
zpe.thermalcorrgfe: 0.399648 hartree
zpe.sumelectzpe: -1385.031469 hartree
zpe.sumelectthermal: -1385.001946 hartree
zpe.sumelectthermalent: -1385.001002 hartree
zpe.sumelectthermalfe: -1385.094013 hartree
dipole: 2.6711 3.3810 2.3104
dipole: 4.8892
quadrupole: -156.0422 -188.6662 -179.8890
quadrupole: -4.6087 5.3954 -3.0309
quadrupole: 18.8236 -13.8004 -5.0232 -4.6087 5.3954 -3.0309
hfenergy: -1385.493661 hartree
pointgroup: C01 [X(C20H27N7O3)]
dipole: -0.8102858 -1.294755 1.1692212 debye
polarizability: 347.829102|67.0845398|236.1160839|1.0649436|9.5913705|246.5688896 unknown
InChI: InChI=1S/C20H27N7O3/c1-26(2)18-17-19(24-11-23-18)27(12-25-17)10-14(28)9-22-20(29)16(21)8-13-4-6-15(30-3)7-5-13/h4-7,11-12,14,16,22,28H,8-10,21H2,1-3H3
charge 0 multiplicity 1
57 atoms
O  -0.045893 1.909419 -2.886703
O  3.236449 2.852866 0.604885
O  0.352417 -3.504033 -1.003872
N  -0.931992 1.645653 0.204119
N  3.234081 1.462834 -1.266493
N  -2.173842 0.724339 1.899738
N  5.788725 1.870702 1.176439
N  -2.277293 0.900577 -1.741523
N  -4.823504 -0.920428 1.14549
N  -4.225531 -0.415668 -1.081509
C  0.750162 1.655973 -1.695205
C  0.168918 2.389492 -0.45331
C  2.177481 2.168795 -2.012468
C  4.804976 0.962748 0.578866
C  -2.007606 0.995825 -0.401661
C  4.17519 -0.058474 1.607416
C  3.693721 1.843848 -0.029144
C  -2.776586 0.425729 0.656894
C  -1.086808 1.448572 1.580582
C  3.156267 -0.999302 0.988852
C  -3.954193 -0.311989 0.274665
C  3.548706 -1.998284 0.053084
C  1.776483 -0.871766 1.273193
C  -3.406433 0.173923 -1.988896
C  2.598177 -2.814544 -0.587663
C  0.803257 -1.682509 0.644533
C  -4.667852 -0.872417 2.610804
C  -6.009181 -1.645137 0.652914
C  1.217721 -2.652156 -0.301315
C  -1.087796 -3.330829 -0.790346
H  0.809334 0.567211 -1.470135
H  -0.203401 3.374602 -0.793654
H  0.957743 2.553707 0.301093
H  2.338886 2.013562 -3.092286
H  2.262821 3.248821 -1.799075
H  5.285596 0.370679 -0.227088
H  3.605506 0.599679 -1.668423
H  5.023209 -0.626083 2.041242
H  3.719704 0.53284 2.423426
H  -0.384208 1.865218 2.299169
H  -0.986091 1.554187 -2.698569
H  5.351257 2.705598 1.582871
H  6.475111 1.422423 1.788585
H  4.613683 -2.148186 -0.166735
H  1.448101 -0.122059 2.003082
H  -3.685401 0.053593 -3.039605
H  2.895297 -3.58467 -1.306358
H  -0.251819 -1.553478 0.904376
H  -4.603216 -1.90142 3.014639
H  -5.549415 -0.37989 3.065832
H  -3.760186 -0.315536 2.88586
H  -5.982345 -2.695313 1.001815
H  -6.01318 -1.617272 -0.445304
H  -6.931338 -1.170812 1.040343
H  -1.566047 -4.066437 -1.453221
H  -1.416258 -2.31027 -1.06784
H  -1.367968 -3.537955 0.260896
