program: Gaussian 09
title: 000017633
version: EM64L-G09RevD.01
frameworkgroup: C1[X(C4H8OS2)]
method: RPBEPBE
basis: SDD
operation: Freq
keyword: #pfreq=noraman
keyword: PBEPBE/SDD
title: #p freq=noraman PBEPBE/SDD
converged: NO YES NO NO
title: Mulliken charges:
elementType: S S O C C C C H H H H H H H H
charge: 0.086669 0.083444 -0.156533 -0.380191 -0.232029 -0.675504 -0.438854 0.222062 0.222025 0.236589 0.236604 0.214487 0.230557 0.214452 0.136223
chargesum: 0.00000
title: Mulliken charges with hydrogens summed into heavy atoms:
elementType: S S O C C C C
charge: 0.222892 0.083444 -0.156533 0.063897 0.241164 -0.016008 -0.438854
polarizability: 1.03610542e+02 3.42401431e+00 9.37028421e+01 3.64090240e-02 -7.18801490e-03 4.45142052e+01
1716.lowfreq: -5.7225 0.0030 0.0031 0.0037 6.2957 9.1370 62.5126 68.8770 105.4664
frequency: 62.3880 68.8262 105.4639 164.9844 220.1788 242.0883 270.8416 320.3909 366.2875 449.1855 525.2014 631.7731 759.4149 833.2085 879.7187 885.4189 935.3696 1007.3762 1048.7239 1133.5236 1138.7654 1194.1935 1225.9617 1278.3127 1305.2290 1369.9220 1396.9482 1467.1129 1477.2075 1480.1910 1489.5503 2461.6994 2982.8883 3001.3972 3010.1434 3050.7876 3069.6913 3088.4924 3090.9635
redmass: 3.4341 1.7500 5.0799 3.4550 1.1107 6.2742 4.1588 1.0596 7.2996 4.7963 10.6915 10.7365 1.0755 2.0036 1.1513 1.6722 2.2140 8.0256 2.8807 2.2171 1.4357 5.8753 1.2686 1.1009 1.3504 1.5210 1.2092 1.0796 1.0542 1.0409 1.0867 1.0378 1.0361 1.0586 1.0585 1.1021 1.1044 1.0990 1.1052
irintensity: 0.0414 0.2768 0.4843 5.0261 0.0000 5.9747 3.7831 31.2888 4.6270 8.1091 0.9237 3.6787 7.2934 17.8495 1.6682 14.0062 46.6229 343.2661 3.6138 38.0201 0.4727 357.2908 0.7802 0.0090 4.5727 0.7722 13.2807 3.8316 2.4245 13.8728 19.3731 6.1675 29.0749 2.7488 27.5612 1.1654 0.9195 37.3465 81.3753
temp: 298.150 k
press: 1.00000 atm
elementType: 16 16 8 6 6 6 6 1 1 1 1 1 1 1 1
symmnumber: 1
zpe: 296014.9 jmol-1
zpe.correction: 0.112746 hartree
zpe.thermalcorrener: 0.121889 hartree
zpe.thermalcorrenthalpy: 0.122834 hartree
zpe.thermalcorrgfe: 0.077399 hartree
zpe.sumelectzpe: -1027.982031 hartree
zpe.sumelectthermal: -1027.972888 hartree
zpe.sumelectthermalent: -1027.971943 hartree
zpe.sumelectthermalfe: -1028.017378 hartree
dipole: 1.9306 -0.3913 -0.0007
dipole: 1.9698
quadrupole: -48.0926 -63.0910 -58.2225
quadrupole: 1.5983 0.0064 0.0040
quadrupole: 8.3761 -6.6223 -1.7538 1.5983 0.0064 0.0040
hfenergy: -1028.094777 hartree
pointgroup: C01 [X(C4H8O1S2)]
dipole: -0.76259 -0.1380749 0.001436 debye
dipolederiv: -0.3887264 0.4583254 -0.0047705 0.4825331 -0.3412702 0.0032407 -0.0051332 0.0032098 -0.0646907 -0.3654912 -0.0374981 0.0000872 -0.0439467 -0.8765424 0.0070146 0.0000486 0.0068269 -0.1414928 -1.9203488 -0.2283975 0.0005627 -0.3380787 -0.5901328 0.0035228 0.0014992 0.0035475 -0.1716051 -0.039446 -0.0013498 0.0001051 0.0393796 0.0703926 0.0011286 -0.0002649 0.0009381 0.1486515 1.0033308 0.0560076 0.0000317 -0.2191956 0.190325 0.0012597 0.0018719 0.00133 0.3508219 -0.0460831 0.0204368 -0.0001155 -0.0692663 0.0392632 0.0006001 0.001033 0.0006578 0.0976076 1.6663559 -0.1520276 0.0038534 0.1483513 1.5537049 -0.0159419 0.0016292 -0.0158736 -0.1206696 0.0494529 0.0286196 0.0228632 -0.0112853 -0.010025 -0.1037403 0.0154339 -0.1224472 -0.059707 0.0494291 0.0283213 -0.0237093 -0.0113436 -0.0048077 0.1024779 -0.0154526 0.1211098 -0.0648658 -0.0376306 -0.0200997 0.0235856 0.0714036 0.0109425 0.075095 0.0095098 0.0777403 -0.0516946 -0.0372158 -0.0208541 -0.023563 0.071088 0.0074132 -0.0761961 -0.0109606 -0.078707 -0.047866 0.0845943 0.007964 0.0162288 0.0559763 -0.0020571 0.1188511 -0.0288633 0.1282107 -0.0836699 -0.134184 -0.1026309 0.001546 -0.128037 0.0021504 0.001567 0.0019432 0.0014994 0.1083143 0.0847693 0.0070637 -0.0169658 0.0562181 -0.0082927 -0.1208694 0.0268827 -0.1300991 -0.0774769 0.0311937 -0.0438808 0.0002605 -0.1037966 -0.0410639 0.0019902 0.0008231 0.0020565 0.1783431 unknown
polarizability: 103.4633575|-3.6270245|93.8453316|0.0872842|-0.4801376|44.5189002 unknown
InChI: InChI=1S/C4H8OS2/c1-2-3-5-4(6)7/h6H,2-3H2,1H3
charge 0 multiplicity 1
15 atoms
S  2.783073 -1.233066 0.013867
S  1.837065 1.759439 -0.015931
O  0.301762 -0.511003 0.003153
C  -2.125591 -0.604245 0.006733
C  -0.927095 0.343569 -0.005434
C  -3.451685 0.189656 -0.001052
C  1.527873 0.103627 -0.000693
H  -2.073606 -1.26884 -0.875007
H  -2.071701 -1.248273 0.903497
H  -0.8937 0.979231 -0.90986
H  -0.8920 1.000262 0.883739
H  -3.53719 0.823958 -0.902775
H  -4.315122 -0.497942 0.009045
H  -3.53417 0.846386 0.884761
H  3.856687 -0.362456 0.006758
