program: Gaussian 09
title: 000193721
version: EM64L-G09RevD.01
frameworkgroup: C1[X(C14H27N5O3)]
method: RPBEPBE
basis: SDD
operation: Freq
keyword: #p
keyword: freq=noraman
keyword: PBEPBE/SDD
title: #p freq=noraman PBEPBE/SDD
converged: YES YES NO NO
title: Mulliken charges:
elementType: O O O N N N N N C C C C C C C C C C C C C C H H H H H H H H H H H H H H H H H H H H H H H H H H H
charge: -0.271280 -0.186072 -0.329057 -0.402816 -0.383486 -0.144430 -0.658466 -0.641353 -0.485630 -0.193315 -0.045144 -0.117724 0.243518 -0.376565 -0.706061 -0.702455 -0.429903 -0.457957 -0.115476 0.299029 -0.805192 0.244108 0.251889 0.186989 0.279733 0.200211 0.277306 0.204266 0.243378 0.356795 0.242987 0.208060 0.207869 0.210905 0.211276 0.215795 0.311565 0.230789 0.223402 0.180750 0.221712 0.180226 0.252679 0.306459 0.200423 0.310133 0.339962 0.316780 0.293387
chargesum: 0.00000
title: Mulliken charges with hydrogens summed into heavy atoms:
elementType: O O O N N N N N C C C C C C C C C C C C C C
charge: -0.271280 -0.186072 -0.329057 -0.046022 -0.071921 -0.144430 -0.008371 -0.031186 -0.046752 0.086418 0.155068 0.159582 0.243518 0.071079 -0.047145 -0.064478 0.024288 -0.055494 0.064750 0.299029 -0.045632 0.244108
polarizability: 2.39392514e+02 1.56265084e+00 2.05107987e+02 -7.35488719e+00 1.26879274e+01 1.56715934e+02
1716.lowfreq: -3.6030 -0.0005 0.0001 0.0003 1.4323 8.8704 19.0083 29.4939 38.7983
frequency: 18.7650 29.2953 38.7119 49.4348 51.0216 62.0645 65.8257 75.7382 89.3036 102.8017 104.0733 113.2838 136.4553 159.7266 172.4881 187.8608 204.1911 210.4791 214.9251 220.6231 232.0382 252.7780 257.0916 262.7924 291.7106 299.0551 316.2758 359.5190 373.0733 386.4560 401.5184 411.1392 429.0885 437.1245 457.2398 480.6476 522.9987 533.7682 547.7980 561.4017 571.4532 594.3564 616.5611 635.8765 673.4916 677.0270 753.6063 761.4443 787.8959 802.3531 809.3597 851.2652 872.0863 878.6369 912.7730 922.5886 934.6165 959.4661 966.0057 973.6437 977.8149 985.8513 1000.2279 1025.3235 1035.9517 1049.7539 1063.5150 1071.9036 1075.0637 1114.4836 1131.3333 1132.8151 1148.5524 1177.5075 1192.3806 1203.0708 1214.4318 1216.1291 1241.1902 1251.8127 1269.3087 1283.1202 1296.0588 1306.4867 1318.0731 1324.7039 1325.6041 1346.7562 1356.2188 1364.0623 1370.0318 1376.5064 1381.8704 1396.3994 1401.1059 1415.2971 1453.7264 1454.6178 1457.1054 1458.5675 1465.3547 1465.9371 1473.4633 1476.5091 1483.9834 1486.7274 1489.9265 1510.1050 1576.2670 1605.4692 1615.5091 1627.5102 1636.8554 1663.2466 2869.5582 2869.6273 2929.4963 2931.2842 2936.6514 2964.6409 2968.8524 2974.6949 2982.8465 2992.1113 2999.7269 3027.9099 3043.0054 3045.8663 3052.5700 3058.4087 3065.0578 3068.7649 3069.7875 3086.6494 3108.9603 3321.8645 3529.6127 3545.4133 3558.2503 3676.0839 3700.5945
redmass: 4.8142 4.5107 4.0870 4.2516 4.0810 3.6181 4.9268 3.5584 4.4102 5.2356 4.6031 5.6850 3.8512 3.3595 2.7471 2.5505 1.3305 1.9906 1.5149 2.6475 2.6601 3.0237 1.1195 2.3577 3.4568 3.7823 1.3568 2.3470 2.1191 2.1973 1.5497 3.3211 2.2938 1.2298 2.7735 2.4096 3.0723 1.3082 2.9851 1.4611 2.9882 3.2340 2.9191 3.8374 3.5792 4.6503 5.2696 1.3950 3.0701 1.8644 2.0326 2.5224 2.0475 2.1339 1.3844 4.0217 1.5189 2.4556 1.7071 2.0649 2.1370 2.0689 1.8617 1.4341 1.8420 2.2790 1.5921 2.6025 2.3799 2.0178 2.4388 2.1733 2.4973 2.2464 1.9008 1.2462 1.4250 1.9041 1.5415 1.3231 1.3354 1.3613 1.8253 1.2193 1.5523 1.3340 1.3577 1.4661 1.3127 1.3808 1.2390 1.4785 1.2053 1.2538 1.2132 3.9030 1.1042 1.0873 1.0756 1.0859 1.2083 1.1954 1.1028 1.0546 1.0542 1.3212 1.1115 1.7050 4.9961 1.2668 1.3978 4.8332 8.3355 2.7234 1.0740 1.0717 1.0962 1.0787 1.0478 1.0768 1.0359 1.0370 1.0663 1.0611 1.0602 1.0852 1.0990 1.0995 1.0887 1.0989 1.0984 1.1040 1.0993 1.0996 1.0984 1.0825 1.0453 1.0781 1.0453 1.1016 1.1030
irintensity: 0.5715 2.6677 0.6166 0.0930 1.2919 1.6658 1.7417 4.2738 3.8591 15.3972 2.9614 5.3670 18.5807 7.8620 2.4361 9.2457 1.1263 4.7356 3.2877 0.2314 1.5004 19.9043 0.3309 10.5682 24.7458 33.6753 42.1553 2.9583 3.1228 36.2861 128.3885 10.7274 50.3482 77.6817 16.9443 9.4995 6.2098 209.7363 20.0721 128.0215 14.6594 22.1863 3.6786 3.3607 19.2313 53.0308 5.3933 10.6523 4.7926 47.8316 62.7747 5.4847 30.9318 24.0603 7.6313 1.5869 2.4754 13.6906 1.3818 11.9421 0.1765 1.2162 7.9275 5.9504 2.0779 11.5717 21.0394 2.5475 4.0190 2.5250 18.8203 7.7575 3.9140 7.0302 12.4824 6.0495 5.3364 31.2570 18.1936 0.8699 11.0021 27.2847 81.8430 4.1203 6.3678 3.2089 9.3608 11.3154 42.8962 1.2157 7.2925 3.4748 20.7631 46.7949 14.2730 100.4706 10.9164 26.5765 6.4451 24.5526 56.2853 85.8558 19.5690 3.0638 51.7554 31.8972 39.5793 215.5411 74.7501 134.4528 101.0354 229.7760 192.3204 561.0949 130.0350 70.7948 48.0238 44.3361 60.4721 15.8828 26.9099 26.5562 47.5812 10.4540 41.2415 7.0539 9.5562 0.1717 24.0452 10.3092 113.9725 29.8287 53.8561 25.0170 10.6047 157.5393 16.1940 21.2631 23.9121 19.4424 23.8811
temp: 298.150 k
press: 1.00000 atm
elementType: 8 8 8 7 7 7 7 7 6 6 6 6 6 6 6 6 6 6 6 6 6 6 1 1 1 1 1 1 1 1 1 1 1 1 1 1 1 1 1 1 1 1 1 1 1 1 1 1 1
symmnumber: 1
zpe: 1086777.3 jmol-1
zpe.correction: 0.413932 hartree
zpe.thermalcorrener: 0.440161 hartree
zpe.thermalcorrenthalpy: 0.441105 hartree
zpe.thermalcorrgfe: 0.356305 hartree
zpe.sumelectzpe: -1047.394302 hartree
zpe.sumelectthermal: -1047.368073 hartree
zpe.sumelectthermalent: -1047.367129 hartree
zpe.sumelectthermalfe: -1047.451929 hartree
dipole: -3.5313 -5.8093 -1.5317
dipole: 6.9688
quadrupole: -93.8371 -137.4265 -144.1804
quadrupole: 7.2999 7.5543 7.2499
quadrupole: 31.3109 -12.2785 -19.0323 7.2999 7.5543 7.2499
hfenergy: -1047.808234 hartree
pointgroup: C01 [X(C14H27N5O3)]
dipole: 1.2876321 2.3289079 -0.6597886 debye
polarizability: 238.8143565|3.8025061|204.4214372|9.4478697|-13.9147252|157.9806413 unknown
InChI: InChI=1S/C14H27N5O3/c1-9(2)7-12(18-10(3)21)13(22)19-11(8-20)5-4-6-17-14(15)16/h8-9,11-12,18-19H,4-7,15-16H2,1-3H3
charge 0 multiplicity 1
49 atoms
O  -1.825811 -1.038323 -1.930343
O  0.895407 -4.388824 0.838229
O  -0.40622 0.902941 1.937769
N  -0.803825 -1.295755 0.156128
N  -1.274251 1.672596 -0.068328
N  3.450074 0.566743 -0.109467
N  5.861227 0.83302 -0.204176
N  4.428078 2.478144 -1.075686
C  -3.537862 1.087098 -0.954898
C  -2.319281 0.618171 -0.132641
C  -4.901861 0.480502 -0.50963
C  0.140525 -2.33036 -0.300778
C  -1.652963 -0.661335 -0.730635
C  1.599938 -1.822412 -0.411195
C  -4.906774 -1.06731 -0.535517
C  -5.354736 1.017912 0.870073
C  2.224492 -1.336363 0.91584
C  3.599985 -0.676717 0.686004
C  -0.028048 -3.592528 0.547479
C  -0.357727 1.732863 0.963027
C  0.743059 2.768153 0.844922
C  4.536972 1.229949 -0.439774
H  -3.354967 0.82768 -2.015646
H  -3.610326 2.190495 -0.875797
H  -2.597065 0.408487 0.91678
H  -5.64318 0.826851 -1.260273
H  -0.215387 -2.604666 -1.321513
H  2.213145 -2.651205 -0.816564
H  1.62981 -0.993106 -1.141942
H  -0.646183 -0.824029 1.06405
H  -4.568517 -1.454091 -1.512735
H  -5.923243 -1.454152 -0.33494
H  -4.236377 -1.486264 0.239646
H  -4.665449 0.704854 1.677326
H  -5.402748 2.123115 0.876609
H  -6.357975 0.631415 1.128345
H  -1.170439 2.291003 -0.875526
H  1.572459 -0.592325 1.410712
H  2.34659 -2.192231 1.606905
H  4.256206 -1.419382 0.168618
H  4.066634 -0.465054 1.675908
H  -1.082534 -3.769426 0.885377
H  0.920593 3.228607 1.830181
H  1.669898 2.232162 0.549187
H  0.521534 3.559591 0.106981
H  6.618732 1.511586 -0.209459
H  6.039047 -0.078512 0.206894
H  3.474035 2.78769 -1.252076
H  5.14211 2.762344 -1.744849
