program: Gaussian 09
title: 000193720
version: EM64L-G09RevD.01
frameworkgroup: C1[X(C18H27N3O2S)]
method: RPBEPBE
basis: SDD
operation: Freq
keyword: #p
keyword: freq=noraman
keyword: PBEPBE/SDD
title: #p freq=noraman PBEPBE/SDD
converged: YES YES NO NO
title: Mulliken charges:
elementType: S O O N N N C C C C C C C C C C C C C C C C C C H H H H H H H H H H H H H H H H H H H H H H H H H H H
charge: 0.884486 -0.541669 -0.535511 -0.461085 -0.196570 -0.570375 -0.356250 -0.404854 -0.358838 -0.434134 -0.214973 0.466431 -0.362997 0.186047 0.307732 -0.285221 -0.388204 -0.449209 -0.367335 -0.260800 -0.372869 -0.258132 -0.660955 -0.652295 0.215565 0.217079 0.202939 0.200098 0.183329 0.181253 0.265487 0.242811 0.183752 0.226805 0.300192 0.298262 0.203918 0.173417 0.282269 0.273580 0.239812 0.242809 0.226620 0.265524 0.228695 0.219888 0.248934 0.206055 0.229917 0.259640 0.268930
chargesum: 0.00000
title: Mulliken charges with hydrogens summed into heavy atoms:
elementType: S O O N N N C C C C C C C C C C C C C C C C C C
charge: 0.884486 -0.541669 -0.535511 -0.160893 -0.196570 -0.041806 0.076394 -0.001816 0.005745 0.074164 -0.214973 0.466431 0.047560 0.186047 0.307732 0.013041 -0.010870 -0.166939 -0.093756 -0.020988 -0.130060 -0.031513 0.053153 0.032611
polarizability: 3.61889861e+02 -9.56144488e+00 2.51589203e+02 -2.81591408e+00 1.75541493e+01 1.79848292e+02
1716.lowfreq: -18.1050 -4.5405 -0.0016 -0.0013 0.0010 3.6350 7.4073 19.2476 23.9182
frequency: -5.6813 18.6077 21.7031 34.9184 41.0666 50.4665 70.5983 84.5779 94.5894 99.1652 115.6189 123.1559 137.2720 152.3653 159.9913 177.6250 196.8911 205.5940 219.8315 232.5992 241.5454 256.5356 264.1504 267.1203 274.6107 298.9916 312.4223 335.2941 339.6728 363.6412 373.4687 404.7368 437.9655 468.6143 472.1924 485.1006 500.6010 505.0978 519.5543 538.0989 578.0876 587.8269 596.3091 669.4939 718.9697 726.6326 745.1850 754.2874 778.7237 790.9599 794.7114 803.9317 818.0766 826.4925 827.8184 845.0257 892.8445 899.1488 920.7962 929.0431 946.1611 952.2343 979.9227 990.8909 993.3229 1014.9717 1036.0736 1049.8587 1053.4371 1067.4159 1067.4667 1086.5242 1090.4642 1094.6068 1099.6023 1115.3699 1128.6979 1130.5857 1157.6512 1176.0453 1191.6600 1197.0282 1202.4765 1210.0757 1214.2478 1247.1092 1255.6537 1259.2773 1280.1960 1285.4278 1295.1517 1305.2602 1317.3309 1333.0307 1349.1153 1363.5745 1364.3025 1370.8170 1384.0100 1385.5450 1399.3229 1427.6695 1430.0049 1440.0300 1440.6705 1454.2429 1459.9831 1463.7038 1468.4405 1468.5419 1476.6087 1482.6688 1483.8410 1493.4001 1500.0398 1508.3551 1578.3319 1586.6090 1620.0919 1637.1765 2853.7648 2902.1989 2922.2829 2944.7585 2950.8242 2960.4588 2969.5446 2978.0638 2989.5130 3002.2219 3003.1826 3020.5398 3030.1159 3032.1429 3037.5410 3050.0683 3094.0034 3117.1541 3134.4141 3144.3157 3157.8295 3158.9570 3168.9834 3174.2740 3344.2156 3449.0695 3577.3086
redmass: 4.3405 4.6233 3.0045 4.1019 2.9435 3.3984 4.1074 2.5790 3.7442 2.6882 2.0077 2.7551 2.3720 3.5547 3.0522 4.0925 3.8758 3.0015 2.7272 2.1951 1.9644 2.4420 1.8803 4.3440 1.8677 3.7847 3.5516 3.6391 3.0737 3.1116 3.6720 8.4390 3.1836 3.3894 4.3761 4.2667 3.1846 3.4785 4.9744 5.6220 5.5798 3.3074 1.2815 4.7204 6.5644 1.0868 1.6446 1.1407 5.0114 2.0594 8.3618 1.3102 1.4037 4.3999 2.7918 1.9933 1.4930 2.2998 2.8024 3.6782 1.3485 1.9644 1.3357 1.6351 1.3348 4.1082 3.4446 2.1343 1.4845 2.3418 2.5069 2.4276 1.4408 2.7238 1.6499 2.0807 1.3926 1.4210 1.5662 1.4056 1.6061 1.3796 2.1656 1.3336 1.8757 1.2918 1.7658 1.3529 1.0832 1.1744 1.1745 1.1255 1.2616 2.0050 1.4496 1.6160 2.9618 1.2945 4.6620 1.4821 2.6425 1.4560 1.8946 1.0896 1.5024 1.0805 1.5700 1.0666 1.0853 1.0657 1.0724 1.0684 1.0952 1.0917 1.4634 2.3057 6.6615 5.2913 7.1132 1.0942 1.0717 1.0525 1.0496 1.0591 1.0605 1.0662 1.0622 1.0625 1.0965 1.0847 1.0961 1.0876 1.0795 1.1025 1.1021 1.1018 1.1003 1.0961 1.0870 1.0867 1.0916 1.0916 1.0983 1.0980 1.0741 1.0447 1.0975
irintensity: 0.5665 1.9640 1.8023 0.3182 0.9262 1.2667 1.0752 3.4446 2.2507 0.5046 1.5584 3.3180 0.7391 3.3734 5.3597 2.4894 2.5856 1.5194 12.0530 28.4658 9.0706 7.8493 3.6415 4.8608 32.5984 8.1546 0.6692 8.4549 3.3461 2.7571 11.9760 51.8452 57.9744 3.3280 80.1063 7.3538 14.8847 2.8096 20.7484 4.5535 10.6962 1.1334 219.0375 5.7030 6.8679 15.8415 4.0276 2.1152 12.6337 218.6895 37.1644 134.9224 3.9465 5.8817 2.5606 1.1105 5.5536 21.1410 23.9511 35.0291 1.4819 2.5507 1.3533 11.3192 2.9958 8.3413 53.6607 3.6710 15.8907 10.5279 10.0406 10.5207 5.4162 2.9281 2.2242 16.9939 20.5035 40.4272 6.7054 14.2674 7.9372 7.5969 12.1450 6.6234 16.4393 5.0933 12.2010 1.8038 4.7470 2.0908 0.0069 3.5762 3.8425 15.1798 1.1936 15.1882 51.3477 19.2488 48.1619 16.8083 24.7966 20.8836 9.5715 17.5645 31.6256 3.3813 29.2190 0.5947 5.2653 27.8163 20.8366 14.5032 13.9604 8.9759 8.8970 42.7101 100.2444 22.2439 11.6566 41.7483 118.0483 114.9215 153.3694 13.9247 42.0746 11.3971 52.4312 20.2515 16.6422 46.8346 24.0929 41.9489 37.4525 7.5970 4.8183 116.4855 21.0493 18.1729 14.2598 5.2214 5.6056 2.1401 24.1168 18.2535 10.3826 2.6238 0.2498
temp: 298.150 k
press: 1.00000 atm
elementType: 16 8 8 7 7 7 6 6 6 6 6 6 6 6 6 6 6 6 6 6 6 6 6 6 1 1 1 1 1 1 1 1 1 1 1 1 1 1 1 1 1 1 1 1 1 1 1 1 1 1 1
symmnumber: 1
zpe: 1109120.6 jmol-1
zpe.correction: 0.422442 hartree
zpe.thermalcorrener: 0.448305 hartree
zpe.thermalcorrenthalpy: 0.449250 hartree
zpe.thermalcorrgfe: 0.365040 hartree
zpe.sumelectzpe: -1412.850480 hartree
zpe.sumelectthermal: -1412.824616 hartree
zpe.sumelectthermalent: -1412.823672 hartree
zpe.sumelectthermalfe: -1412.907882 hartree
dipole: -4.5909 -0.8606 3.9044
dipole: 6.0878
quadrupole: -103.0618 -148.3134 -157.2344
quadrupole: -6.2044 5.0619 5.6628
quadrupole: 33.1414 -12.1102 -21.0312 -6.2044 5.0619 5.6628
hfenergy: -1413.2729218 hartree
pointgroup: C01 [X(C18H27N3O2S1)]
dipole: -1.8131817 1.2211027 0.9787413 debye
polarizability: 361.8352234|-6.3269631|208.0885476|8.0621542|-39.2237956|223.4035849 unknown
InChI: InChI=1S/C18H27N3O2S/c1-21(2)17-11-7-10-16-15(17)9-8-12-18(16)24(22,23)20-14-6-4-3-5-13-19/h7-12,20H,3-6,13-14,19H2,1-2H3
charge 0 multiplicity 1
51 atoms
S  0.996211 -0.563659 0.525438
O  1.695513 -1.691493 1.477777
O  1.450496 -0.404533 -1.037889
N  1.221884 1.114896 1.37963
N  -5.589457 0.371221 -0.189244
N  8.496428 -0.515033 -1.742963
C  4.363134 0.539558 0.97685
C  3.693296 1.519226 1.967713
C  5.795876 0.975576 0.59547
C  2.279001 1.106974 2.43426
C  -0.883483 -0.819263 0.678244
C  -1.806817 -0.066798 -0.119339
C  6.466479 0.016934 -0.413227
C  -3.217544 -0.282942 0.174626
C  -4.217788 0.499252 -0.538261
C  -1.244636 -1.773205 1.620761
C  7.909307 0.428402 -0.768494
C  -1.428835 0.816788 -1.182458
C  -3.588217 -1.304008 1.108224
C  -2.632285 -2.041967 1.809732
C  -3.799681 1.328599 -1.597006
C  -2.420438 1.467773 -1.918608
C  -6.01639 0.706104 1.189916
C  -6.600588 0.723281 -1.198339
H  3.754779 0.447917 0.053483
H  4.386869 -0.473583 1.425105
H  4.329711 1.611224 2.872376
H  3.649871 2.534953 1.518678
H  5.767689 1.999051 0.164427
H  6.417343 1.041831 1.514134
H  2.300038 0.088836 2.871337
H  1.916725 1.796033 3.222303
H  6.472738 -1.010417 0.010005
H  5.8751 -0.032368 -1.347277
H  1.45485 1.74915 0.588849
H  -0.470634 -2.315345 2.173402
H  7.89251 1.43359 -1.234008
H  8.496323 0.523944 0.180301
H  -0.374474 0.924789 -1.450228
H  -4.650163 -1.536325 1.22863
H  -2.93777 -2.834288 2.500028
H  -4.536433 1.905457 -2.163726
H  -2.134014 2.122093 -2.749539
H  -5.185868 0.574435 1.89847
H  -6.856104 0.058443 1.505376
H  -6.352597 1.765359 1.255916
H  -6.326658 0.294566 -2.176513
H  -6.741363 1.823067 -1.318265
H  -7.571896 0.293817 -0.893227
H  8.49775 -1.48864 -1.42062
H  9.410613 -0.234071 -2.111023
