program: Gaussian 09
title: 000193713
version: EM64L-G09RevD.01
frameworkgroup: C1[X(C9H18O6)]
method: RPBEPBE
basis: SDD
operation: Freq
keyword: #pfreq=noraman
keyword: PBEPBE/SDD
title: #p freq=noraman PBEPBE/SDD
converged: YES YES NO NO
title: Mulliken charges:
elementType: O O O O O O C C C C C C C C C H H H H H H H H H H H H H H H H H H
charge: -0.290330 -0.336140 -0.447285 -0.461660 -0.290477 -0.261913 -0.076468 -0.052101 -0.116025 -0.156374 -0.314903 -0.054193 -0.503279 -0.505703 -0.487731 0.266036 0.264737 0.227819 0.212212 0.222690 0.191452 0.377013 0.217745 0.210957 0.230398 0.248650 0.361642 0.220805 0.212652 0.244891 0.200771 0.236701 0.207412
chargesum: 0.00000
title: Mulliken charges with hydrogens summed into heavy atoms:
elementType: O O O O O O C C C C C C C C C
charge: -0.290330 -0.336140 -0.070271 -0.100018 -0.290477 -0.261913 0.189567 0.212635 0.111794 0.055838 0.099239 0.163552 0.186726 0.172645 0.157153
polarizability: 1.30456220e+02 -3.26164956e+00 1.19565724e+02 2.23295483e-01 -1.86472898e+00 1.09394426e+02
1716.lowfreq: -10.1329 -0.0008 -0.0007 -0.0005 6.9451 9.9017 30.2106 33.0256 54.2134
frequency: 29.6342 33.0129 54.1778 71.1043 76.9891 80.8967 91.3106 97.1771 142.3256 149.0019 158.6889 167.9011 216.8102 227.3583 234.5126 264.8639 288.5137 304.1291 312.2368 329.8838 375.5789 400.6086 453.9666 462.4392 537.3554 557.1835 596.3671 648.5924 697.1366 739.3395 766.6603 813.9516 868.1995 892.1220 928.2499 957.6721 979.7873 1008.7116 1032.5429 1044.0421 1054.8418 1061.5664 1076.3667 1100.6276 1113.5778 1114.3143 1116.2541 1126.6118 1146.9579 1157.5676 1163.3822 1177.7130 1190.8174 1244.6968 1272.4802 1301.2340 1309.3807 1319.8744 1323.1701 1339.1713 1359.6175 1364.2021 1388.5733 1423.2131 1433.3600 1436.6167 1444.9667 1455.5495 1458.0803 1460.1453 1468.3926 1471.7623 1473.0569 1486.1649 1569.4305 2921.0674 2923.1035 2931.8523 2951.4045 2960.1055 2987.7055 2995.1512 3004.5815 3004.8524 3022.9155 3025.0848 3038.2882 3054.5237 3106.5151 3110.6181 3114.5660 3348.1126 3365.9638
redmass: 3.8708 4.8589 3.6076 5.2049 2.4598 2.1013 1.3056 3.3417 1.4534 3.4954 1.9482 4.1032 2.3839 2.5554 3.1492 3.7849 5.1869 4.8281 4.0176 4.1452 4.0722 5.0530 4.9122 3.7015 3.3699 1.1517 1.1046 2.9415 5.1664 3.0951 4.7298 3.1018 3.3153 5.5425 2.3290 2.3928 2.1892 3.1259 6.0138 3.0055 5.4528 4.4693 2.9749 2.4035 1.3383 1.2866 1.5370 1.9794 1.3347 1.3986 1.5619 1.1862 1.3198 1.3350 1.2215 1.2922 1.1772 1.2330 1.3147 1.2987 1.3484 1.5078 1.5065 1.1958 1.1379 1.1440 1.1650 1.0547 1.0519 1.0548 1.0599 1.0521 1.0567 1.0737 7.0215 1.0540 1.0809 1.0400 1.0332 1.0319 1.0970 1.0834 1.0856 1.1025 1.0914 1.0885 1.1029 1.1035 1.0977 1.1008 1.0998 1.0640 1.0660
irintensity: 1.1482 2.1261 3.9970 0.8872 5.3569 4.4719 1.8313 3.3935 0.7909 5.7223 1.1335 2.8746 1.8074 3.9392 4.9876 9.8675 17.2245 15.2782 19.7918 7.1331 13.3420 11.2544 3.7268 5.0749 33.9949 142.2838 84.5337 6.2547 16.1175 1.3303 7.8516 36.3852 3.9475 23.0164 12.4266 17.8424 48.0093 21.2102 181.2647 41.3665 101.9516 71.1127 28.8114 47.8313 4.1205 2.1743 9.9138 2.4470 1.0820 18.7241 3.5571 4.4218 7.3763 27.1683 1.5357 16.1898 15.8358 39.6905 11.8539 5.6916 4.7650 25.3670 34.9783 31.9961 10.5746 0.0960 35.2898 6.9985 13.8192 15.6317 11.1627 20.5675 17.3485 9.3625 147.2249 52.8577 41.1712 92.1674 64.3977 44.9586 52.0667 6.9102 18.2814 67.7915 38.9611 73.0377 50.8061 39.4346 26.6278 14.7952 19.3391 49.6771 179.5251
temp: 298.150 k
press: 1.00000 atm
elementType: 8 8 8 8 8 8 6 6 6 6 6 6 6 6 6 1 1 1 1 1 1 1 1 1 1 1 1 1 1 1 1 1 1
symmnumber: 1
zpe: 707957.1 jmol-1
zpe.correction: 0.269647 hartree
zpe.thermalcorrener: 0.288130 hartree
zpe.thermalcorrenthalpy: 0.289074 hartree
zpe.thermalcorrgfe: 0.221792 hartree
zpe.sumelectzpe: -803.767899 hartree
zpe.sumelectthermal: -803.749415 hartree
zpe.sumelectthermalent: -803.748471 hartree
zpe.sumelectthermalfe: -803.815753 hartree
dipole: -2.8950 2.4728 0.9765
dipole: 3.9306
quadrupole: -91.9277 -75.0220 -102.8086
quadrupole: 2.1064 -9.0249 1.4203
quadrupole: -2.0082 14.8974 -12.8892 2.1064 -9.0249 1.4203
hfenergy: -804.0375452 hartree
pointgroup: C01 [X(C9H18O6)]
dipole: 0.9120541 1.2285558 -0.2239679 debye
polarizability: 128.7478818|5.2319038|120.4132322|0.0140557|3.458898|110.2552564 unknown
InChI: InChI=1S/C9H18O6/c1-13-5-7(12)9(15-3)8(14-2)6(11)4-10/h4,6-9,11-12H,5H2,1-3H3
charge 0 multiplicity 1
33 atoms
O  -0.728717 -1.389232 0.710912
O  -0.625129 1.526204 1.032021
O  1.322511 0.067475 2.246514
O  -1.629647 0.073231 -2.256569
O  2.855827 -0.071757 -1.136791
O  -3.300223 -1.378234 -0.762172
C  0.273915 -0.54442 0.042921
C  -0.444559 0.785077 -0.239521
C  1.564605 -0.430561 0.894623
C  -1.827504 0.541455 -0.897022
C  2.630448 0.452988 0.213522
C  -2.701069 -0.461632 -0.125567
C  -0.565016 -2.831959 0.514003
C  -0.645238 2.984947 0.868312
C  3.946418 0.610023 -1.830457
H  0.541374 -0.980199 -0.941177
H  0.168772 1.385111 -0.942368
H  1.984693 -1.447428 1.009201
H  -2.378514 1.510321 -0.90486
H  3.561791 0.412525 0.816685
H  2.295306 1.514636 0.172512
H  0.538396 0.687095 2.179646
H  -2.896182 -0.242891 0.942121
H  -0.30174 -3.062985 -0.537354
H  0.210318 -3.230331 1.194635
H  -1.54107 -3.282293 0.754208
H  -2.2505 -0.708826 -2.361703
H  -1.476541 3.306079 0.211315
H  0.314104 3.35146 0.449531
H  -0.795474 3.4034 1.875436
H  3.73564 1.694018 -1.95314
H  4.025926 0.139352 -2.822779
H  4.907179 0.492552 -1.285943
