program: Gaussian 09
title: 000193712
version: EM64L-G09RevD.01
frameworkgroup: C1[X(C17H21BrN3)]
method: RPBEPBE
basis: SDD
operation: Freq
keyword: #p
keyword: freq=noraman
keyword: PBEPBE/SDD
title: #p freq=noraman PBEPBE/SDD
converged: YES YES NO NO
title: Mulliken charges:
elementType: Br N N N C C C C C C C C C C C C C C C C C H H H H H H H H H H H H H H H H H H H H H
charge: -0.007270 -0.106057 -0.103293 -0.120384 -0.540714 -0.560287 -0.538818 -0.558597 0.487976 -0.449033 -0.389265 0.151622 -0.208656 -0.336729 0.198615 0.530394 -0.453270 -0.292961 -0.350712 -0.183755 -0.848681 0.281318 0.274555 0.262331 0.263505 0.295899 0.266121 0.266727 0.267753 0.259834 0.292954 0.264404 0.282843 0.244728 0.255877 0.277565 0.254817 0.284336 0.252214 0.247872 0.295231 0.288992
chargesum: 1.00000
title: Mulliken charges with hydrogens summed into heavy atoms:
elementType: Br N N N C C C C C C C C C C C C C C C C C
charge: -0.007270 -0.106057 -0.103293 -0.120384 0.015159 0.261447 0.261784 0.258594 0.487976 -0.166190 -0.144538 0.151622 0.047221 -0.059165 0.198615 0.530394 -0.198453 -0.008624 -0.098498 0.064118 -0.264458
polarizability: 4.14142739e+02 1.03762005e+01 2.43722853e+02 -2.19987810e+01 5.95355350e+00 1.32046797e+02
1716.lowfreq: -9.5154 -5.0470 -0.0008 -0.0006 -0.0003 2.4202 6.9648 20.0145 28.4941
frequency: 2.4474 20.0069 28.4788 41.4567 58.4100 78.9517 84.6932 95.7763 127.4473 157.2914 182.9764 217.3632 247.2226 254.1411 255.5473 262.9071 268.7995 288.7756 293.3236 309.4058 347.2022 384.5327 399.9425 424.2033 431.4842 438.2942 476.0637 503.3911 520.0103 532.2546 545.1240 561.5542 616.1925 644.6015 662.8050 686.4647 701.5522 723.2711 750.1002 804.3565 821.4674 826.2128 834.8433 872.3303 901.3331 918.5473 932.2197 937.0983 945.6039 948.5429 952.3555 954.8403 985.1491 986.2097 991.1361 1003.2290 1006.3061 1044.3989 1077.1325 1083.7941 1096.3413 1099.0464 1113.5509 1123.8560 1156.3373 1178.9232 1182.0270 1183.5327 1215.2245 1218.5844 1234.4943 1240.5577 1262.9179 1286.7319 1300.3205 1306.8190 1348.3186 1360.6735 1389.9224 1399.5100 1419.4990 1420.4649 1428.6969 1439.5788 1448.6796 1452.4310 1458.4410 1460.3125 1466.0547 1467.2855 1468.9393 1474.2188 1482.8791 1483.5576 1499.2272 1576.7614 1590.3745 1596.3072 1609.3925 3022.1697 3024.5438 3025.2415 3029.3807 3068.5707 3099.4034 3125.9907 3136.1989 3138.1311 3138.8933 3139.7852 3142.9078 3144.2378 3148.0804 3150.3531 3151.7180 3153.8805 3159.5041 3160.2189 3178.7398 3179.6072
redmass: 5.4041 8.8969 3.5194 3.0750 5.0112 5.6622 4.4219 3.6321 6.3880 1.6332 1.7402 4.5207 4.0549 1.1836 3.0748 1.2618 4.7156 3.2918 2.3840 4.5751 2.6042 2.4010 2.5529 3.2113 2.1561 2.9402 2.9945 4.3376 6.5914 6.0486 6.8532 4.7264 5.2306 5.2383 6.4203 2.0303 2.3080 3.3274 5.2202 2.4125 1.7461 2.0457 3.2744 1.5790 2.4117 1.5905 1.6667 1.5307 2.4586 1.6731 1.9814 2.1547 5.2751 6.1368 2.1911 1.3635 1.3643 1.1978 1.5170 1.4594 1.3285 1.3750 1.1201 2.0369 1.6169 1.2866 1.1593 1.2185 1.1413 1.7269 2.9715 1.8698 3.5667 1.6600 1.3749 1.4025 1.3581 8.2044 6.9008 8.5747 1.1423 1.1460 2.8183 3.0028 1.0493 1.1351 1.1005 1.1256 1.0642 2.0121 1.1922 2.4290 1.0802 1.0592 1.0534 5.8790 6.3343 6.2833 6.5421 1.0330 1.0324 1.0499 1.0406 1.0578 1.1078 1.0904 1.0967 1.1018 1.1037 1.0892 1.1046 1.1047 1.0932 1.1052 1.1095 1.1049 1.0925 1.0907 1.0987 1.0976
irintensity: 2.7883 3.4746 1.2639 0.4816 2.4768 0.1095 2.9158 1.3207 0.4032 0.2830 0.6991 0.9238 1.5220 2.2469 2.4073 0.1550 3.8017 1.0747 1.6618 0.7526 3.2207 0.5294 0.0230 0.9955 0.0943 1.9049 1.7118 11.2444 61.5770 5.2165 20.6009 7.7653 12.9313 10.1676 3.3351 23.2929 34.1693 21.0200 10.8574 77.3584 34.0605 39.1975 7.1748 4.6835 8.0192 10.1314 16.0498 4.8767 3.8654 3.9060 7.1750 10.5232 7.1137 2.2752 1.5287 0.7143 0.5472 0.0167 22.0720 3.8559 1.1492 8.1749 8.6027 30.7608 73.0147 0.8858 3.8174 1.1655 34.8955 1.8186 47.8560 6.7522 11.7987 0.9121 0.8164 7.5595 24.4239 173.5338 0.4434 10.2527 18.7954 17.8377 11.0837 11.8917 0.7966 10.6445 7.9687 9.2987 2.9027 12.3882 3.0975 11.8798 39.5152 40.8799 92.8680 18.8550 1.5362 18.1599 15.9768 1.4206 4.1795 10.4016 12.9591 12.9961 1.7653 5.7516 5.9560 1.1300 0.3901 2.5347 3.2881 10.2952 3.5211 1.3091 1.5815 2.0868 8.4650 4.8668 6.9259 9.0777
temp: 298.150 k
press: 1.00000 atm
elementType: 35 7 7 7 6 6 6 6 6 6 6 6 6 6 6 6 6 6 6 6 6 1 1 1 1 1 1 1 1 1 1 1 1 1 1 1 1 1 1 1 1 1
symmnumber: 1
zpe: 908623.1 jmol-1
zpe.correction: 0.346076 hartree
zpe.thermalcorrener: 0.367014 hartree
zpe.thermalcorrenthalpy: 0.367958 hartree
zpe.thermalcorrgfe: 0.291101 hartree
zpe.sumelectzpe: -836.303331 hartree
zpe.sumelectthermal: -836.282394 hartree
zpe.sumelectthermalent: -836.281449 hartree
zpe.sumelectthermalfe: -836.358306 hartree
dipole: 19.2780 -4.9318 3.0254
dipole: 20.1276
quadrupole: -7.4239 -94.8336 -128.3098
quadrupole: -45.8271 -5.4157 -5.0481
quadrupole: 69.4319 -17.9779 -51.4540 -45.8271 -5.4157 -5.0481
hfenergy: -836.6494073 hartree
pointgroup: C01 [X(C17H21Br1N3)]
dipole: -7.7224363 0.4826005 1.6847484 debye
polarizability: 403.9924239|44.781516|253.0727355|-1.2985894|-18.5376874|132.8472288 unknown
InChI: InChI=1S/C17H21BrN3/c1-21(2,3)13-15-7-5-9-17(11-15)20-19-16-8-4-6-14(10-16)12-18/h4-11H,12-13H2,1-3H3
charge 1 multiplicity 1
42 atoms
Br 5.279569 3.323507 -1.459288
N  -4.3354 1.560127 0.379249
N  0.552512 -1.611992 0.031761
N  1.088082 -0.418335 0.072578
C  -3.864714 0.688149 -0.852842
C  -3.13155 2.095104 1.1491
C  -5.147771 2.733677 -0.163027
C  -5.205661 0.729854 1.31616
C  -3.053678 -0.533017 -0.491439
C  -1.64761 -0.443326 -0.382151
C  -3.692412 -1.795188 -0.323154
C  -0.879042 -1.598243 -0.075516
C  -2.927656 -2.944723 -0.027911
C  -1.525216 -2.849502 0.095054
C  2.51487 -0.395521 0.123103
C  4.493973 1.059365 0.264983
C  3.08937 0.896767 0.225585
C  3.347924 -1.551657 0.063719
C  5.315456 -0.09707 0.200232
C  4.743133 -1.39029 0.102349
C  5.103083 2.424536 0.382093
H  -3.290132 1.388875 -1.482671
H  -4.800245 0.42181 -1.374065
H  -2.506214 2.693215 0.468638
H  -3.493562 2.725669 1.97594
H  -2.548146 1.251438 1.54328
H  -6.018176 2.347226 -0.715187
H  -5.487786 3.358272 0.677449
H  -4.514669 3.330872 -0.837028
H  -6.090591 0.375007 0.765814
H  -4.623714 -0.128763 1.679562
H  -5.520456 1.361053 2.161573
H  -1.110095 0.49702 -0.551982
H  -4.777817 -1.886135 -0.454704
H  -3.421023 -3.914442 0.08778
H  -0.909235 -3.728585 0.308542
H  2.421661 1.764953 0.258257
H  2.885552 -2.539548 -0.01643
H  6.405808 0.014464 0.218546
H  5.396244 -2.267517 0.054351
H  6.1325 2.40945 0.76638
H  4.485134 3.131944 0.95312
