program: Gaussian 09
title: 000193707
version: EM64L-G09RevD.01
frameworkgroup: C1[X(C12H22O11)]
method: RPBEPBE
basis: SDD
operation: Freq
keyword: #p
keyword: freq=noraman
keyword: PBEPBE/SDD
title: #p freq=noraman PBEPBE/SDD
converged: YES YES NO NO
title: Mulliken charges:
elementType: O O O O O O O O O O O C C C C C C C C C C C C H H H H H H H H H H H H H H H H H H H H H H
charge: -0.279991 -0.296824 -0.453451 -0.477727 -0.462806 -0.470686 -0.445635 -0.451760 -0.494010 -0.463801 -0.142970 -0.197824 -0.197773 -0.097762 -0.012623 -0.021043 -0.033657 -0.114953 -0.385359 -0.232466 -0.051017 -0.390290 -0.061885 0.284498 0.259911 0.234687 0.260353 0.241072 0.231836 0.245432 0.198856 0.255747 0.270067 0.205812 0.363266 0.365734 0.363833 0.254425 0.227955 0.368208 0.173002 0.347013 0.361921 0.368303 0.354379
chargesum: 0.00000
title: Mulliken charges with hydrogens summed into heavy atoms:
elementType: O O O O O O O O O O O C C C C C C C C C C C C
charge: -0.279991 -0.296824 -0.090185 -0.111994 -0.098973 -0.102478 -0.098622 -0.089839 -0.125707 -0.109422 -0.142970 0.086674 0.062138 0.136926 0.247730 0.220029 0.198179 0.130480 0.069244 0.037601 0.154795 0.092090 0.111117
polarizability: 1.86713628e+02 1.63093615e+00 1.67970288e+02 6.43740424e+00 -2.04132996e+00 1.44178819e+02
1716.lowfreq: -2.7209 -0.0004 -0.0004 0.0005 6.2612 12.1390 14.7472 31.6909 34.9519
frequency: 12.8311 31.4482 34.8495 41.1370 47.2618 55.4064 67.7141 84.2842 93.8126 115.2038 121.0704 127.3015 158.2602 160.2848 177.5160 210.8955 211.7367 243.8083 251.5177 267.9880 284.5383 294.5600 299.1405 308.4726 310.6494 315.9462 323.4115 337.5700 354.0616 376.0564 393.7386 407.9517 419.0804 438.8145 448.2890 457.9394 490.3374 513.4803 521.2528 537.1876 560.3730 575.1217 608.5441 615.7394 619.9829 656.8705 663.3147 771.6546 791.8890 841.3203 844.1118 880.6013 891.2232 917.9481 929.4444 938.4409 954.9144 967.2112 978.6245 1002.0306 1007.3273 1013.8276 1018.6538 1030.2608 1040.5272 1043.8768 1054.1670 1055.1196 1069.6929 1088.6761 1098.4333 1115.9194 1133.4041 1141.5718 1177.0108 1177.7459 1192.5640 1215.1711 1234.4700 1248.7889 1257.0901 1272.2726 1273.1827 1281.1078 1287.4916 1289.2186 1296.2194 1299.4508 1310.2626 1317.4940 1322.6749 1326.7677 1338.4292 1345.3753 1353.8333 1362.5177 1369.6013 1375.4191 1381.3818 1385.2556 1389.9918 1393.6691 1406.3355 1434.9463 1448.6548 1462.0799 1659.1155 2847.9911 2939.4344 2955.1644 2971.0575 2977.9410 3014.5818 3023.4985 3040.6904 3044.7336 3066.9860 3073.3995 3097.7695 3116.9669 3121.8937 3333.1758 3414.2107 3486.0770 3521.6174 3531.9587 3546.0826 3573.8814 3596.5624
redmass: 6.7324 7.1937 6.2968 6.8625 7.4229 4.9466 7.8232 5.9337 5.9025 5.8425 3.7178 3.7585 4.9633 5.4593 3.4223 4.7116 4.4262 5.4357 4.5041 1.8420 3.4163 3.2524 2.2457 3.9758 2.8754 1.3397 1.5559 3.8308 4.1125 3.9563 5.4596 4.3118 3.0879 1.2736 1.2981 3.1341 5.7459 4.3110 3.7482 3.8591 1.2173 3.4066 3.9019 1.1241 1.6550 2.0680 3.8256 4.4234 3.2900 2.5700 3.6831 4.5243 3.7820 3.5376 4.4100 4.2606 4.5326 2.8641 2.7528 4.4097 2.2343 3.1894 3.2775 4.0705 3.6967 4.1946 2.8554 2.8783 2.5852 2.8762 2.5140 2.0006 1.4339 2.4338 1.2739 1.2875 1.4212 1.3543 1.2345 1.2099 1.1585 1.2210 1.1429 1.3156 1.2613 1.3582 1.3215 1.2641 1.2501 1.2785 1.2167 1.2557 1.2003 1.1930 1.2381 1.2838 1.3134 1.3073 1.2400 1.2271 1.4129 1.3584 1.7889 1.3407 1.0827 1.0813 8.5632 1.0852 1.0834 1.0827 1.0831 1.0698 1.0833 1.0853 1.0602 1.0855 1.0865 1.0873 1.0867 1.0955 1.1071 1.0681 1.0642 1.0645 1.0652 1.0662 1.0654 1.0665 1.0668
irintensity: 0.5943 0.8520 7.9063 0.9880 0.8325 3.7375 5.8485 7.0243 3.3182 1.5563 6.1286 3.8968 17.2338 4.0341 6.1657 1.0673 8.9574 37.9669 2.9411 61.0272 16.3023 25.5709 62.2288 12.8983 51.6902 65.6855 78.0618 26.9921 13.5391 19.6238 2.7377 14.9694 8.6039 223.6643 69.5913 2.7670 6.4838 9.8945 5.1432 17.4478 226.0245 7.4387 15.3591 145.8855 127.3584 29.0001 28.3226 28.7738 17.7488 14.1239 76.7960 127.0401 42.2659 95.7362 84.7234 12.4622 83.5887 64.7031 2.4297 226.7630 51.6897 30.8966 67.7603 55.9512 25.4991 53.8997 46.8564 29.7034 22.7300 39.2620 63.5446 37.2323 28.2166 11.3368 2.4372 20.8484 31.0036 47.1320 6.8766 79.3731 5.0050 21.2708 6.4714 8.4156 4.8170 13.6518 1.5837 17.8069 38.4677 9.2587 22.8828 22.9004 12.1553 21.0640 10.0219 3.5865 0.4431 15.6339 61.9812 9.5948 18.0567 43.8196 10.5030 41.1946 12.1867 6.0762 117.0032 80.7279 44.8074 30.6837 13.2450 41.0117 43.2814 30.0604 20.9845 14.8347 18.2383 11.7115 8.4170 8.3187 18.0066 225.1762 63.1215 28.8401 20.6621 16.7981 4.8921 12.0541 17.6295
temp: 298.150 k
press: 1.00000 atm
elementType: 8 8 8 8 8 8 8 8 8 8 8 6 6 6 6 6 6 6 6 6 6 6 6 1 1 1 1 1 1 1 1 1 1 1 1 1 1 1 1 1 1 1 1 1 1
symmnumber: 1
zpe: 929790.8 jmol-1
zpe.correction: 0.354139 hartree
zpe.thermalcorrener: 0.379989 hartree
zpe.thermalcorrenthalpy: 0.380933 hartree
zpe.thermalcorrgfe: 0.296830 hartree
zpe.sumelectzpe: -1295.972363 hartree
zpe.sumelectthermal: -1295.946512 hartree
zpe.sumelectthermalent: -1295.945568 hartree
zpe.sumelectthermalfe: -1296.029671 hartree
dipole: -3.7024 -2.0762 -0.8251
dipole: 4.3242
quadrupole: -143.6804 -132.0154 -150.4978
quadrupole: -6.0840 -11.9370 -2.0385
quadrupole: -1.6159 10.0491 -8.4332 -6.0840 -11.9370 -2.0385
hfenergy: -1296.3265014 hartree
pointgroup: C01 [X(C12H22O11)]
dipole: -1.4495411 0.7737718 0.4409468 debye
polarizability: 185.6585697|-1.1744544|167.9603802|-9.3682316|-1.7643073|145.2437851 unknown
InChI: InChI=1S/C12H22O11/c13-1-4(16)7(18)11(5(17)2-14)23-12-10(21)9(20)8(19)6(3-15)22-12/h2,4-13,15-21H,1,3H2
charge 0 multiplicity 1
45 atoms
O  1.467884 0.04564 1.306241
O  -0.285211 0.018496 -0.34707
O  2.990455 2.598809 -1.7402
O  1.621621 3.05697 0.559605
O  4.370711 0.152064 -1.035046
O  -3.347333 -1.345627 1.430643
O  2.616672 -2.424832 1.963696
O  -2.329267 -3.067653 -0.428617
O  -2.283063 2.06341 0.511281
O  -4.939028 2.400639 0.242345
O  -0.20582 -2.188856 -2.927665
C  2.294618 1.475498 -1.099996
C  1.088727 1.966723 -0.279487
C  3.285194 0.688967 -0.215099
C  0.490188 0.842159 0.595514
C  2.559654 -0.495887 0.436361
C  -1.172978 -0.972356 0.279405
C  -2.373457 -0.320642 1.031432
C  3.421361 -1.352364 1.362145
C  -1.583869 -1.872233 -0.912118
C  -3.053617 0.831456 0.252186
C  -4.502022 1.069891 0.736557
C  -0.345405 -2.328651 -1.696552
H  1.952104 0.825774 -1.92353
H  0.285682 2.339794 -0.940275
H  3.678284 1.364747 0.574822
H  -0.167274 1.262888 1.373641
H  2.109182 -1.133664 -0.349296
H  -0.598555 -1.586812 1.008438
H  -2.009134 0.12543 1.975653
H  3.885556 -0.714846 2.142969
H  4.21213 -1.846854 0.779294
H  -2.279317 -1.363374 -1.596994
H  -3.059187 0.634259 -0.843307
H  2.997336 3.334624 -1.068406
H  0.87356 3.593261 0.920129
H  4.65071 0.881974 -1.64893
H  -4.53612 1.148328 1.833988
H  -5.181681 0.263793 0.412716
H  -3.281946 -2.129418 0.809227
H  0.423602 -2.857012 -1.070439
H  1.894957 -1.981324 2.48037
H  -1.700766 -3.721157 -0.023161
H  -2.945267 2.803398 0.393033
H  -5.28207 2.31737 -0.682699
