program: Gaussian 09
title: 000193686
version: EM64L-G09RevD.01
frameworkgroup: C1[X(C18H19NO3)]
method: RPBEPBE
basis: SDD
operation: Freq
keyword: #p
keyword: freq=noraman
keyword: PBEPBE/SDD
title: #p freq=noraman PBEPBE/SDD
converged: NO YES NO NO
title: Mulliken charges:
elementType: O O O N C C C C C C C C C C C C C C C C C C H H H H H H H H H H H H H H H H H H H
charge: -0.277674 -0.306434 -0.245042 -0.258495 0.098320 -0.246963 -0.566153 -0.019699 0.220645 0.411097 -0.532471 -0.474053 -0.243478 -0.153810 -0.019742 -0.575881 0.228406 -0.337109 -0.349673 0.163321 -0.524969 -0.529802 0.251842 0.227970 0.258489 0.241916 0.222486 0.224457 0.234385 0.223268 0.233870 0.242920 0.259632 0.250801 0.249942 0.235622 0.217502 0.256187 0.229826 0.222481 0.256064
chargesum: 0.00000
title: Mulliken charges with hydrogens summed into heavy atoms:
elementType: O O O N C C C C C C C C C C C C C C C C C C
charge: -0.277674 -0.306434 -0.245042 -0.016579 0.098320 0.004878 -0.079695 -0.019699 0.220645 0.411097 -0.085527 -0.016400 -0.009608 0.089110 -0.019742 -0.316248 0.228406 -0.086308 -0.099730 0.163321 0.184343 0.178569
polarizability: 2.84248474e+02 -1.20138653e+01 2.07376304e+02 -9.71246234e-01 -2.33956542e+00 1.42120309e+02
1716.lowfreq: -8.3919 -0.6406 -0.0010 -0.0009 -0.0008 7.3667 33.0696 43.1880 68.8694
frequency: 33.0231 43.1324 68.8580 69.9992 94.4270 112.7863 120.9036 144.1352 152.2293 166.0513 176.2840 208.8751 227.1227 239.9499 255.9827 273.1073 278.0932 301.7295 334.8357 357.7797 387.0066 404.6680 413.9931 438.1046 457.6854 494.3193 514.5994 536.6180 542.9344 570.3440 582.4590 599.1510 648.8800 665.1998 678.5290 693.2276 757.0115 763.0707 770.9078 781.7739 792.5888 805.6184 852.7591 864.0697 893.5105 894.1606 916.3608 928.4162 942.9781 961.5931 968.0575 994.3461 1002.4150 1004.5724 1025.5915 1040.6497 1064.8410 1084.6636 1097.7179 1111.9150 1113.2572 1124.8829 1148.7559 1154.0299 1156.1115 1178.5574 1185.7504 1194.3402 1204.9590 1226.4840 1248.4448 1268.3977 1278.2203 1283.6220 1305.2632 1317.2787 1337.1820 1355.2313 1367.4054 1371.3637 1380.7451 1398.2597 1418.9998 1434.3485 1441.3399 1448.8414 1455.7667 1457.0774 1457.5360 1458.8270 1464.4581 1475.8862 1486.2886 1559.0166 1589.9004 1605.8912 1613.3649 1656.1804 2951.3936 2965.1425 2970.8618 2974.0459 2992.9087 2993.4866 3017.1140 3063.2718 3067.5697 3072.0562 3090.8439 3093.8045 3103.7252 3120.9006 3125.3043 3142.2687 3147.4318 3151.5938 3389.6525
redmass: 7.7010 4.4081 3.5692 3.5956 2.8012 3.1437 3.1452 3.0563 1.2051 1.1196 3.1003 3.9697 3.1760 4.7862 3.5357 3.3939 5.0636 3.5552 4.1830 4.2961 5.9249 2.9296 5.4763 4.1468 3.7998 3.1330 3.5461 3.5669 3.6702 5.0895 5.5615 4.3543 2.7371 4.2322 3.3181 3.1946 2.7780 6.2963 2.6701 3.0112 1.8413 4.5343 2.0708 2.0739 3.8715 1.6229 2.7631 3.2580 3.2584 4.7377 2.6047 1.3208 1.7774 2.4458 2.0329 5.0882 2.4122 2.5130 2.1821 1.2537 1.2601 2.8736 1.3610 1.4046 1.2660 1.1684 1.4396 2.6920 1.5025 1.3861 1.9308 1.7372 2.1699 1.8848 1.8472 1.4963 1.5188 1.2762 3.5915 1.9343 2.4506 3.1797 1.2948 1.1760 1.3950 1.2383 1.2279 1.1444 1.0788 1.1249 1.6384 1.0593 1.0523 8.4582 9.2430 8.3529 8.3496 6.9958 1.0826 1.0610 1.0308 1.0311 1.0671 1.0655 1.0939 1.1036 1.1042 1.1036 1.0899 1.0964 1.0874 1.1026 1.1031 1.0916 1.0961 1.0979 1.0739
irintensity: 2.4036 1.1530 0.2045 0.2526 5.0896 4.3136 2.6293 2.0266 0.6158 0.6631 10.9391 2.5963 0.3010 2.6270 9.8294 4.7234 4.3748 0.9071 1.4492 2.3213 5.3617 1.5725 3.1665 8.9720 0.9143 4.1247 7.2546 5.4249 5.8443 6.7384 6.5306 3.7616 4.9688 18.6920 51.5173 38.3394 53.9384 3.4469 2.8056 23.6833 4.1043 5.3800 8.3281 63.2481 26.4231 10.0798 9.2899 2.6393 28.7880 59.4530 20.4018 0.5615 10.2933 14.4386 23.3065 9.0418 25.7630 17.1659 48.7633 10.3133 1.5141 18.0606 2.1476 3.2309 12.5714 10.7103 2.1114 11.7407 39.0837 7.6404 19.6024 31.5595 75.1086 2.3813 27.3384 7.9243 5.7951 9.3726 4.2498 0.4612 17.3205 5.4934 2.0116 14.7968 5.6837 15.3820 53.1618 17.3050 14.8323 16.6630 46.8312 6.9492 19.2220 178.6948 13.6618 4.0360 16.5896 129.1413 20.7703 36.3383 79.4987 54.0388 41.5740 24.4055 46.5235 41.2801 26.9765 23.1877 7.2261 29.7109 6.9985 24.9914 14.1727 6.5328 22.0626 1.4727 1.6794
temp: 298.150 k
press: 1.00000 atm
elementType: 8 8 8 7 6 6 6 6 6 6 6 6 6 6 6 6 6 6 6 6 6 6 1 1 1 1 1 1 1 1 1 1 1 1 1 1 1 1 1 1 1
symmnumber: 1
zpe: 865272.4 jmol-1
zpe.correction: 0.329565 hartree
zpe.thermalcorrener: 0.349411 hartree
zpe.thermalcorrenthalpy: 0.350355 hartree
zpe.thermalcorrgfe: 0.281580 hartree
zpe.sumelectzpe: -976.067385 hartree
zpe.sumelectthermal: -976.047539 hartree
zpe.sumelectthermalent: -976.046595 hartree
zpe.sumelectthermalfe: -976.115370 hartree
dipole: 5.7820 1.0916 -0.9787
dipole: 5.9650
quadrupole: -154.2675 -126.2541 -118.5730
quadrupole: -6.2730 7.1351 1.5878
quadrupole: -21.2360 6.7774 14.4586 -6.2730 7.1351 1.5878
hfenergy: -976.39695 hartree
pointgroup: C01 [X(C18H19N1O3)]
dipole: 2.3040559 -0.2271882 0.3837799 debye
polarizability: 281.4686494|18.6997426|210.1962861|1.4619041|-1.470485|142.0801515 unknown
InChI: InChI=1S/C18H19NO3/c1-21-14-9-11-5-8-19-13-10-18(6-3-12(20)4-7-18)16(15(11)13)17(14)22-2/h3-4,6-7,9,13,19H,5,8,10H2,1-2H3
charge 0 multiplicity 1
41 atoms
O  -0.770621 -2.19694 0.119861
O  1.916672 -3.322227 0.02795
O  -5.179865 0.134215 -0.482271
N  2.080282 3.136181 0.492422
C  -1.029834 0.906894 0.124858
C  1.031428 2.306808 -0.152635
C  -0.376049 2.319105 0.499393
C  1.383305 0.832172 -0.125417
C  0.23945 0.022257 0.010782
C  2.695109 0.328614 -0.094933
C  3.859233 1.315102 -0.011337
C  3.400452 2.811312 -0.12809
C  -1.97459 0.473561 1.22119
C  -1.713861 0.991781 -1.2293
C  0.376207 -1.379381 0.059927
C  2.837857 -1.081326 -0.045167
C  1.701629 -1.921842 -0.012747
C  -3.306318 0.248942 1.035203
C  -3.040434 0.741931 -1.422168
C  -3.937108 0.357985 -0.303749
C  -0.879238 -3.067065 1.315791
C  1.400029 -4.054299 -1.153499
H  0.954455 2.664186 -1.201169
H  -0.266898 2.37252 1.601103
H  -1.008466 3.16007 0.173381
H  2.095792 2.96828 1.512036
H  4.379577 1.161103 0.956323
H  4.610819 1.106643 -0.798561
H  4.169409 3.469837 0.313477
H  3.318206 3.082853 -1.198035
H  -1.528544 0.376566 2.221926
H  -1.072988 1.269088 -2.077527
H  3.824211 -1.558925 -0.035547
H  -3.967052 -0.035177 1.862523
H  -3.50333 0.812829 -2.413409
H  -1.784414 -3.670761 1.151962
H  -1.002937 -2.445904 2.222914
H  0.01141 -3.712223 1.416557
H  1.601932 -5.117133 -0.950925
H  1.941687 -3.734375 -2.063848
H  0.315895 -3.883357 -1.282044
