program: Gaussian 09
title: 000193682
version: EM64L-G09RevD.01
frameworkgroup: C1[X(C20H23NO)]
method: RPBEPBE
basis: SDD
operation: Freq
keyword: #p
keyword: freq=noraman
keyword: PBEPBE/SDD
title: #p freq=noraman PBEPBE/SDD
converged: YES YES NO NO
title: Mulliken charges:
elementType: O N C C C C C C C C C C C C C C C C C C C C H H H H H H H H H H H H H H H H H H H H H H H
charge: -0.297953 -0.092350 0.074485 -0.536190 -0.383542 0.441530 0.385361 -0.343605 -0.393098 -0.412546 -0.413563 -0.428269 -0.616098 -0.627925 -0.239594 -0.238954 -0.253409 -0.227825 -0.246796 -0.246990 0.254245 -0.493590 0.237155 0.236096 0.235407 0.210539 0.256647 0.243908 0.245388 0.277877 0.252287 0.237425 0.224025 0.189902 0.220985 0.220792 0.189005 0.241532 0.223395 0.223093 0.221547 0.222995 0.225646 0.225594 0.275435
chargesum: 0.00000
title: Mulliken charges with hydrogens summed into heavy atoms:
elementType: O N C C C C C C C C C C C C C C C C C C C C
charge: -0.297953 -0.092350 0.074485 -0.062940 0.062405 0.441530 0.385361 -0.086958 -0.149190 -0.167158 -0.135686 0.061444 0.018814 0.023405 -0.016199 -0.015862 -0.031862 -0.004831 -0.021150 -0.021397 0.254245 -0.218154
polarizability: 2.33788934e+02 -2.15598086e+01 2.21255291e+02 1.72019955e+01 -9.86826325e+00 1.88521872e+02
1716.lowfreq: -8.7831 -5.5947 -0.0009 -0.0008 -0.0007 7.1022 12.4432 33.3316 43.4916
frequency: 10.1093 33.2422 43.4597 48.7338 53.6617 58.1707 64.1828 67.7330 125.0948 140.3097 161.0103 198.1178 213.8617 220.5085 236.1194 243.3460 264.2001 282.9429 287.0129 315.9346 320.9970 347.0546 355.0035 399.8823 403.3369 410.3925 426.5929 469.4056 503.1901 530.8859 556.1788 615.5579 616.2056 629.0861 629.8614 637.9487 665.2310 692.0992 702.1069 707.1440 757.9980 766.5494 788.6845 821.4455 851.1367 857.8646 869.2017 900.5600 914.5015 932.9451 935.5222 977.8015 979.4444 982.2886 990.3169 990.4988 995.2931 995.7172 998.8744 1021.7125 1024.4144 1030.8609 1032.2237 1047.4788 1068.2257 1073.5615 1086.2459 1093.3600 1101.0934 1135.7162 1169.5827 1170.7926 1172.1476 1186.3776 1191.4357 1194.8034 1201.4035 1243.1358 1260.6492 1266.7718 1294.1079 1302.0127 1314.9562 1323.1622 1344.9974 1370.0922 1379.8679 1382.5824 1417.7907 1432.8162 1435.6741 1439.6634 1447.9827 1459.6210 1466.0841 1475.1843 1477.7494 1480.3473 1482.7351 1485.4698 1495.8594 1589.8521 1591.6920 1609.2970 1612.9758 2136.9694 2847.6531 2856.9707 2873.0115 2974.8066 2995.9926 3017.6657 3024.9016 3028.0039 3045.6224 3057.0956 3075.7018 3083.0065 3117.4535 3120.2760 3126.0298 3130.0375 3139.3002 3143.5499 3151.7827 3157.2742 3163.4501 3176.2506 3426.3356
redmass: 4.0110 3.8684 3.7787 3.7414 3.1115 4.0896 4.0584 4.6885 3.9535 3.6074 2.8552 2.8067 2.7900 3.1827 1.2167 2.2248 2.1193 4.8840 4.6138 4.3647 3.3294 2.2423 2.0738 2.8150 2.8678 4.0473 2.2672 3.1164 3.3420 3.9600 6.3068 6.2444 6.2854 3.9346 1.2708 5.5356 1.2710 4.6149 1.6835 1.7159 2.1213 1.7384 2.3987 2.9029 1.2815 1.2529 2.1960 3.0132 3.0467 1.7081 1.6247 1.4415 3.6689 1.5023 5.7089 4.8136 2.1604 1.3560 1.3614 2.7495 2.6074 1.5350 2.0960 2.8630 1.8867 1.9292 1.5898 1.4456 1.9670 1.4553 1.5579 1.1082 1.1136 1.2543 1.7683 1.1755 3.0195 1.4587 1.7625 1.8537 1.1833 1.5692 1.3336 1.3328 1.1934 1.5633 6.4202 6.3091 1.1425 2.2158 2.2431 1.1653 1.0897 1.0491 1.0542 1.0513 2.0028 1.4847 1.3270 1.1421 1.1055 6.2411 6.1332 6.0821 6.0429 6.0062 1.0570 1.0617 1.0653 1.0626 1.0598 1.0728 1.0769 1.0826 1.0979 1.1011 1.1010 1.1006 1.0853 1.0843 1.0879 1.0878 1.0938 1.0921 1.0957 1.0988 1.1011 1.0952 1.1589
irintensity: 0.3617 0.0350 0.0130 0.1471 0.3375 0.0496 0.2680 0.9275 0.7734 0.5559 1.1680 0.9608 0.7062 0.5496 0.1749 1.4779 1.0327 4.0365 1.7045 0.4234 13.1465 7.5539 7.1452 0.2364 0.1660 1.6347 0.7118 1.1533 1.1361 10.2985 12.0250 0.7546 0.7952 14.2477 70.6950 13.9055 67.4874 2.9835 51.1448 62.6881 30.7873 34.9821 13.1330 21.1754 0.6437 0.0252 7.9406 23.1818 33.2230 1.9676 1.2198 6.0539 84.1282 8.6258 2.3400 7.1567 15.6013 1.3161 5.8228 25.3890 1.6065 19.2029 22.2089 14.1712 17.7846 14.0663 5.9110 13.3231 7.1330 14.7587 5.4860 2.4598 1.4613 9.6010 0.8927 1.6853 31.8901 10.9829 5.9241 1.6715 9.7537 21.4983 3.6876 1.9149 7.5353 5.9167 1.9560 1.0687 4.6168 10.8571 12.5102 2.3347 13.3300 15.1828 10.9204 11.0437 21.1531 1.4295 21.2356 7.0275 12.6104 1.6275 0.4089 8.3826 2.0128 0.3390 65.6009 92.4181 175.3821 25.5161 13.5169 40.9995 44.4882 11.1420 11.2543 24.9249 27.1044 55.1044 3.6892 0.6142 3.0905 5.9705 31.8620 27.6538 32.5172 34.1039 18.0734 8.1165 51.1800
temp: 298.150 k
press: 1.00000 atm
elementType: 8 7 6 6 6 6 6 6 6 6 6 6 6 6 6 6 6 6 6 6 6 6 1 1 1 1 1 1 1 1 1 1 1 1 1 1 1 1 1 1 1 1 1 1 1
symmnumber: 1
zpe: 979420.2 jmol-1
zpe.correction: 0.373041 hartree
zpe.thermalcorrener: 0.395002 hartree
zpe.thermalcorrenthalpy: 0.395946 hartree
zpe.thermalcorrgfe: 0.319844 hartree
zpe.sumelectzpe: -904.180194 hartree
zpe.sumelectthermal: -904.158234 hartree
zpe.sumelectthermalent: -904.157289 hartree
zpe.sumelectthermalfe: -904.233391 hartree
dipole: -0.8543 -0.3700 1.2093
dipole: 1.5262
quadrupole: -119.7891 -128.5144 -124.8935
quadrupole: -2.1241 2.7048 -2.2999
quadrupole: 4.6099 -4.1154 -0.4945 -2.1241 2.7048 -2.2999
hfenergy: -904.5532353 hartree
pointgroup: C01 [X(C20H23N1O1)]
dipole: 0.2912657 -0.0013084 -0.5250701 debye
polarizability: 237.7258223|16.8262046|212.6295374|19.33192|15.7945332|193.2107371 unknown
InChI: InChI=1S/C20H23NO/c1-4-17-22-20(15-16-21(2)3,18-11-7-5-8-12-18)19-13-9-6-10-14-19/h1,5-14H,15-17H2,2-3H3
charge 0 multiplicity 1
45 atoms
O  0.211903 -0.864965 1.357332
N  3.18218 -1.604435 -1.37794
C  0.020665 -0.025773 0.12846
C  0.953433 -0.513044 -1.016651
C  2.444656 -0.56473 -0.614793
C  -1.47379 -0.032384 -0.264439
C  0.442725 1.395236 0.569502
C  -2.423198 0.330049 0.726508
C  0.158651 2.493678 -0.282286
C  -1.939343 -0.368539 -1.557893
C  1.136833 1.630293 1.78021
C  0.18954 -2.331819 1.200085
C  4.525513 -1.848379 -0.810972
C  3.252441 -1.311935 -2.825437
C  -3.801374 0.345179 0.436851
C  0.570503 3.798545 0.062298
C  -3.322306 -0.350688 -1.854414
C  1.543365 2.939397 2.129526
C  -4.258985 0.003293 -0.85905
C  1.267382 4.027958 1.272245
C  -1.125956 -2.934519 0.911426
C  -2.197383 -3.507051 0.701933
H  0.811212 0.161741 -1.880173
H  0.64873 -1.52543 -1.34421
H  2.523334 -0.821159 0.458062
H  2.906502 0.44739 -0.736146
H  -2.066559 0.588183 1.729393
H  -0.40457 2.330587 -1.209102
H  -1.236195 -0.658119 -2.345233
H  1.340535 0.786908 2.444515
H  0.92265 -2.655352 0.434118
H  0.546452 -2.690912 2.182357
H  4.434494 -2.130931 0.253103
H  5.203988 -0.959579 -0.874657
H  5.009202 -2.684593 -1.347458
H  3.772303 -2.137066 -3.344351
H  3.796603 -0.359195 -3.053163
H  2.236761 -1.233862 -3.249219
H  -4.520011 0.622639 1.216431
H  0.340824 4.635737 -0.606753
H  -3.665478 -0.616011 -2.861108
H  2.075571 3.106802 3.073157
H  -5.33068 0.017003 -1.088518
H  1.583724 5.041413 1.544154
H  -3.146144 -3.971265 0.503301
