program: Gaussian 09
title: 000193672
version: EM64L-G09RevD.01
frameworkgroup: C1[X(C10H11NO2)]
method: RPBEPBE
basis: SDD
operation: Freq
keyword: #p
keyword: freq=noraman
keyword: PBEPBE/SDD
title: #p freq=noraman PBEPBE/SDD
converged: YES YES NO NO
title: Mulliken charges:
elementType: O O N C C C C C C C C C C H H H H H H H H H H H
charge: -0.310948 -0.307119 -0.404916 0.114031 0.318128 0.122176 0.223844 -0.428303 -0.395653 -0.360891 -0.229707 -0.528095 -0.529310 0.320005 0.239679 0.256646 0.243159 0.252525 0.225759 0.262243 0.221815 0.226783 0.244682 0.223469
chargesum: 0.00000
title: Mulliken charges with hydrogens summed into heavy atoms:
elementType: O O N C C C C C C C C C C
charge: -0.310948 -0.307119 -0.084911 0.114031 0.318128 0.122176 0.223844 -0.188624 -0.139007 -0.117733 0.022818 0.181723 0.165623
polarizability: 1.67989081e+02 4.59848850e+00 1.31314227e+02 1.96819924e+00 6.18945804e+00 6.48371626e+01
1716.lowfreq: -5.3814 0.0002 0.0007 0.0008 3.5838 12.0677 70.7259 92.5141 106.1640
frequency: 70.7030 92.5103 106.1551 153.6480 164.5945 171.9459 215.4131 231.1744 254.3945 286.6955 348.0567 401.1436 464.1289 482.3424 539.5837 561.1948 576.9992 615.2565 641.4867 663.0379 734.1679 749.5093 775.4735 818.1672 859.5902 867.0060 902.9134 919.5546 941.8901 997.8802 1036.1020 1058.9396 1109.4034 1115.8769 1117.1400 1148.8176 1153.4642 1162.5580 1210.3750 1214.3948 1281.4747 1331.0644 1368.9278 1396.8632 1422.5408 1438.6493 1445.6774 1455.4652 1459.0878 1476.8778 1486.9214 1489.1795 1513.0560 1579.9866 1635.6897 2965.2796 2974.1656 3058.5024 3073.9842 3113.5529 3121.1713 3141.5586 3165.6131 3211.8657 3238.4628 3617.2856
redmass: 3.2353 3.8096 2.7737 2.3718 1.0897 1.2808 4.2537 4.3325 4.4190 5.0259 4.5685 6.0722 5.2280 5.6288 3.2252 1.9247 3.3392 2.2304 5.9180 3.6650 1.4484 5.7501 3.7423 1.5140 1.3728 6.9030 5.1227 6.7313 1.3364 5.4133 2.8295 1.5975 1.3288 1.2390 1.2365 1.3945 1.3698 1.8485 2.3735 1.9496 3.0753 2.2537 3.8144 3.1464 1.3211 1.2345 3.4933 1.0652 1.0535 1.0658 3.0960 1.0626 5.2063 7.3681 8.2220 1.0305 1.0313 1.1046 1.1028 1.1020 1.1037 1.0874 1.0969 1.0908 1.1065 1.0809
irintensity: 4.2014 1.1266 6.5203 3.4489 0.0927 1.8779 7.8075 3.5625 10.3596 9.5224 1.8989 2.1632 5.1222 2.7825 22.3600 41.0150 26.9107 8.9158 4.3125 28.6313 57.0367 6.3805 7.6724 62.1259 10.7492 5.8937 21.2759 34.6304 0.5529 95.1128 70.7805 23.6369 3.1702 5.9389 5.4124 2.3844 0.1720 15.6921 23.3522 83.0481 3.0484 94.3738 45.1207 6.2769 6.2288 6.8903 41.4544 9.5400 6.7856 9.5971 36.9214 25.0792 5.2857 7.5793 6.9975 76.2371 70.5449 31.8634 25.7633 31.5365 21.1575 5.3193 14.1477 1.6234 5.0730 70.2324
temp: 298.150 k
press: 1.00000 atm
elementType: 8 8 7 6 6 6 6 6 6 6 6 6 6 1 1 1 1 1 1 1 1 1 1 1
symmnumber: 1
zpe: 498822.4 jmol-1
zpe.correction: 0.189991 hartree
zpe.thermalcorrener: 0.202033 hartree
zpe.thermalcorrenthalpy: 0.202977 hartree
zpe.thermalcorrgfe: 0.152156 hartree
zpe.sumelectzpe: -591.879337 hartree
zpe.sumelectthermal: -591.867295 hartree
zpe.sumelectthermalent: -591.866351 hartree
zpe.sumelectthermalfe: -591.917172 hartree
dipole: 0.0528 2.1527 0.5250
dipole: 2.2164
quadrupole: -66.4673 -66.4748 -79.0309
quadrupole: 0.3667 -1.7667 -1.8791
quadrupole: 4.1904 4.1829 -8.3733 0.3667 -1.7667 -1.8791
hfenergy: -592.0693285 hartree
pointgroup: C01 [X(C10H11N1O2)]
dipole: -0.1108975 0.8511591 -0.1537464 debye
dipolederiv: -0.6462408 -0.4168207 -0.1980647 -0.3987499 -1.0054099 -0.3309958 -0.1080227 -0.1844928 -0.4472846 -1.3426312 -0.0997032 0.095947 -0.309683 -0.4111256 -0.0106628 0.0037881 -0.0108523 -0.3778895 -0.4123396 -0.1880553 -0.0412776 0.1801125 -0.5937285 0.0662901 -0.0568328 -0.0400492 -0.2722292 0.0246843 -0.2356628 0.0347697 -0.4908262 0.1041172 -0.1952052 0.0228096 -0.1324997 0.009711 0.2259392 -0.1522139 0.0557772 0.1365499 -0.1516242 0.0614068 0.0482925 -0.0301689 0.0378009 0.2984191 0.2681317 0.0971641 0.4378208 0.8203843 0.2609562 -0.0003569 0.021044 -0.0335419 0.9805761 0.1358486 0.0196044 0.128966 0.0895779 0.0210821 0.2262733 0.0839367 -0.0590491 0.0605385 -0.0015559 0.0746039 -0.0424342 0.0754159 -0.0487819 0.0692772 -0.0315725 -0.1624722 -0.0551347 0.1484199 0.0520362 0.0154426 -0.1673407 -0.0182162 0.0531361 0.0398397 -0.2685606 -0.2409818 0.0053967 0.0322061 -0.1234965 -0.0039133 -0.0438012 0.0699816 -0.0245039 -0.1495047 -0.0254784 0.330443 0.0327582 0.2517389 0.4108132 0.0367926 0.0247671 0.0432969 -0.1631829 0.3525862 0.2449372 0.0984773 0.0848479 0.3403355 0.1555327 0.1420937 0.3418647 0.5210874 0.5557678 0.0285213 -0.1519689 0.2405008 0.2536131 -0.0113847 -0.3873615 -0.0006151 0.376722 0.1964085 -0.0272608 -0.026753 -0.0374978 0.2366527 -0.001253 -0.0321416 0.0034629 0.3277452 0.0543994 -0.0830731 -0.0191066 -0.0577153 -0.082284 0.0087876 -0.0310138 0.008834 0.1590273 0.0060643 -0.060054 -0.0480896 -0.0990805 0.029822 -0.0131399 -0.045665 -0.0030646 0.1887638 0.0254899 0.0948695 -0.0463075 0.0798958 -0.0084495 0.0258653 -0.0399101 0.0323762 0.1506718 0.0045551 0.0532905 -0.0610635 0.0752866 0.0592183 0.0328785 -0.0626716 0.0263387 0.1934819 0.0769583 -0.0861033 -0.0095931 -0.1085659 -0.1501234 -0.0185098 -0.0062406 0.0209153 0.0600478 -0.0333195 0.0197655 -0.0752387 0.1043466 0.0836607 0.0644068 -0.0507644 -0.0159486 0.0345892 -0.0508652 0.0135646 0.1417615 -0.0236266 0.0769996 -0.0004032 0.0370442 -0.1156233 -0.1124049 -0.1903776 -0.0280196 -0.0444852 -0.0397709 0.1125199 0.0021248 -0.0705398 -0.0012721 0.0515092 0.0790185 0.0699808 -0.018209 -0.0204339 -0.0863313 0.0895415 0.0464628 0.0607004 0.0295962 0.0559637 -0.0346469 0.0050519 0.0163723 -0.0327997 -0.1333112 0.1475946 -0.0919463 -0.0946343 unknown
polarizability: 163.8048783|0.3121366|131.2721499|21.9065297|0.2369375|69.0634424 unknown
InChI: InChI=1S/C10H11NO2/c1-12-8-4-3-7-5-6-11-9(7)10(8)13-2/h3-6,11H,1-2H3
charge 0 multiplicity 1
24 atoms
O  0.806223 1.915191 0.311312
O  2.531594 -0.409371 0.916105
N  -1.997961 1.245942 -0.380147
C  -0.997909 0.333267 -0.04709
C  -1.566612 -0.986653 -0.09758
C  0.348856 0.573765 0.303683
C  1.159222 -0.555764 0.572279
C  -0.739211 -2.098977 0.220895
C  -2.956251 -0.822086 -0.478857
C  0.610462 -1.871144 0.545351
C  -3.184055 0.543911 -0.645592
C  1.362382 2.370663 1.609304
C  3.374837 0.07574 -0.20001
H  -1.854866 2.251469 -0.441301
H  -1.140133 -3.117653 0.208845
H  -3.693484 -1.611439 -0.614149
H  1.285725 -2.699183 0.784287
H  -4.093377 1.069319 -0.931836
H  1.701306 3.403591 1.435697
H  2.204536 1.728106 1.919994
H  0.575425 2.353778 2.387125
H  4.393265 0.156179 0.210945
H  3.026341 1.061463 -0.561184
H  3.360687 -0.651713 -1.033976
