program: Gaussian 09
title: 000193665
version: EM64L-G09RevD.01
frameworkgroup: C1[X(C16H24N2O15P2)]
method: RPBEPBE
basis: SDD
operation: Freq
keyword: #p
keyword: freq=noraman
keyword: PBEPBE/SDD
title: #p freq=noraman PBEPBE/SDD
converged: YES YES NO NO
title: Mulliken charges:
elementType: P P O O O O O O O O O O O O O O O N N C C C C C C C C C C C C C C C C H H H H H H H H H H H H H H H H H H H H H H H H
charge: 1.430857 1.451571 -0.312531 -0.346137 -0.458110 -0.441096 -0.455065 -0.511526 -0.549336 -0.752960 -0.216464 -0.692061 -0.260813 -0.570119 -0.770289 -0.724216 -0.549324 -0.063135 -0.640827 -0.014500 -0.150315 -0.209923 -0.074361 -0.353269 -0.024181 -0.160599 -0.321548 -0.153986 -0.380531 -0.098178 0.303143 -0.198418 -0.314080 -0.047013 0.099526 0.259346 0.222446 0.193428 0.261132 0.223379 0.240647 0.329968 0.362559 0.302291 0.351427 0.302231 0.264308 0.260999 0.273609 0.303630 0.289932 0.369071 0.252994 0.406344 0.331233 0.400874 0.456310 0.432032 0.439622
chargesum: 0.00000
title: Mulliken charges with hydrogens summed into heavy atoms:
elementType: P P O O O O O O O O O O O O O O O N N C C C C C C C C C C C C C C C C
charge: 1.430857 1.451571 -0.312531 -0.346137 -0.095551 -0.441096 -0.085993 -0.511526 -0.142992 -0.752960 -0.216464 -0.235751 -0.260813 -0.570119 -0.338256 -0.284594 -0.549324 -0.063135 0.091280 0.244846 0.072132 -0.016496 0.186771 0.110757 0.305787 0.141693 0.029879 0.148245 0.144777 0.175430 0.303143 0.105212 -0.024148 0.205981 0.099526
polarizability: 3.75246854e+02 -1.27299317e+01 3.50615434e+02 -7.40499183e-01 -1.20704057e+00 1.83136794e+02
1716.lowfreq: -7.4559 -1.6754 -0.0009 0.0009 0.0011 3.6479 16.0495 21.5352 28.6816
frequency: 15.5393 21.4594 28.6463 32.2661 38.0226 42.3086 49.8709 54.8781 63.0648 65.3317 76.8906 85.2601 89.1154 107.5610 114.5615 115.9742 147.9729 154.2780 160.4770 164.6106 178.3266 179.6765 197.3573 203.6695 213.7495 223.2154 228.0371 244.1040 245.9550 250.5330 253.3445 276.1161 286.9005 295.9685 300.3548 314.0625 319.0410 339.8914 342.6118 348.4870 361.3708 370.4659 377.0936 385.5798 391.4779 397.7688 414.2745 437.2275 446.2775 459.4133 481.7711 493.1489 496.3500 539.6270 543.3515 564.0199 568.0983 592.2048 604.6912 617.7298 632.1262 637.3800 650.2221 658.6549 673.8041 677.6855 679.7375 701.2757 708.0269 710.2803 728.1308 740.8321 757.5948 760.6931 781.8157 792.7236 802.8889 820.7307 841.4911 851.5616 857.3554 863.9330 889.0630 900.2466 921.9081 930.0396 942.2821 959.0556 986.9006 987.7809 996.2413 996.5866 1008.7692 1010.6393 1013.1986 1014.2875 1032.6037 1045.7501 1049.7425 1067.4700 1077.8655 1084.2734 1095.2339 1102.7940 1104.0676 1105.9502 1128.7309 1144.5458 1158.0511 1161.5824 1178.5158 1201.9083 1203.5315 1211.3005 1222.8421 1224.3953 1225.7041 1233.7072 1240.7418 1253.7540 1263.3521 1279.4662 1294.3919 1299.2583 1304.7978 1313.5045 1315.4155 1323.4460 1329.5318 1335.5807 1344.3492 1345.6856 1359.5873 1367.1203 1378.7298 1385.4389 1389.4824 1408.9065 1428.9511 1441.6909 1462.0111 1485.1051 1557.3717 1599.0401 1604.4486 1621.8017 1653.8236 2344.9985 2837.1347 2973.7816 2980.5024 2989.7871 3016.8352 3034.5781 3038.8585 3043.8267 3060.1554 3067.1986 3078.8733 3105.5204 3166.7057 3184.0058 3201.0288 3219.2508 3225.3482 3227.1301 3230.3087 3247.5950 3443.7920 3600.3425 3637.3511
redmass: 9.8114 7.8635 7.1078 6.8924 8.4818 7.3297 7.0337 7.9993 9.0981 6.6783 6.5539 9.7053 7.9669 7.9768 7.0198 5.6031 7.0771 5.2520 5.1928 6.2435 5.8496 4.7756 3.2243 7.4731 5.7215 3.4224 4.9535 4.5819 5.2501 4.9808 4.0758 7.0240 5.8173 4.0448 4.6413 4.9576 7.3831 6.6699 8.4978 4.9277 7.4008 4.6930 6.0071 5.3718 5.9938 6.6837 5.0515 3.7424 4.5266 3.4837 3.7557 3.5054 4.9951 9.0731 3.6818 1.1362 5.0945 5.0387 4.4638 3.6297 1.7108 1.3940 4.4822 3.3017 2.1477 1.7564 2.4822 3.4922 3.7665 1.9823 3.3568 8.1030 4.6818 2.5774 4.1342 1.6575 4.2720 1.9748 6.1960 2.7399 2.1493 1.4121 3.0694 3.5816 3.7597 1.4631 5.1457 3.1304 4.0203 5.2498 2.1015 2.6471 2.2314 1.3761 3.0242 3.5474 3.5111 3.4428 3.6983 3.5048 8.0719 2.5048 2.3395 2.1230 3.0149 2.2779 3.3038 2.1576 1.6273 1.3826 1.4462 1.5036 1.2192 1.1525 1.2009 1.1874 1.4331 1.3419 1.1958 1.2624 1.2971 1.2498 1.2674 1.1879 1.3102 1.2284 1.2667 1.4840 1.3873 1.3524 1.7424 1.6492 1.3051 1.2675 1.5452 1.8489 1.2679 1.2203 2.6120 1.0876 1.0775 2.3547 5.5058 7.9633 4.9964 3.5248 1.4155 1.0898 1.0799 1.0820 1.0820 1.0675 1.0848 1.0852 1.0751 1.0687 1.0923 1.0874 1.1017 1.1053 1.0908 1.0961 1.0667 1.0940 1.0629 1.0959 1.0696 1.0640 1.0643 1.0866 1.0669
irintensity: 0.2714 0.6478 2.1993 2.3067 0.4943 1.1627 3.8630 0.7939 0.6761 4.6751 1.3461 6.7898 2.4673 0.9078 6.6702 6.4387 7.3737 10.8834 2.7161 15.7786 7.0915 8.8056 26.3131 6.4425 3.5607 77.7553 4.6628 10.4786 70.4612 3.8988 10.2872 12.4432 5.3183 8.4547 12.7671 11.3443 40.5010 57.0156 37.9800 8.2818 36.0374 7.9429 8.4658 10.3189 4.2100 88.2819 53.7070 4.6531 50.3965 9.7221 10.6452 25.8085 10.4485 28.9036 2.1019 130.2543 20.5099 2.8565 9.2665 22.1797 24.6664 109.0033 166.0733 35.7985 155.8226 13.3711 8.3773 80.7171 23.1459 60.5239 70.5868 384.2816 22.1626 297.9304 67.5893 10.3203 15.4288 22.7273 127.1516 34.6972 31.4874 99.8652 8.5673 89.6004 51.8950 6.4821 42.0623 137.2841 39.7483 243.6623 11.3823 42.7689 5.0745 70.1759 50.3272 46.8670 2.0552 2.6228 28.0011 27.2131 201.7666 50.5532 50.7100 46.3040 133.4086 57.6380 87.5605 19.2761 15.1169 83.3525 19.1104 85.3211 101.0180 112.6063 87.1193 58.0039 4.1500 6.4797 6.1187 42.0899 8.6214 24.1595 6.2749 0.6401 12.1895 24.7469 8.1985 8.5884 41.9283 71.8089 69.4377 10.9877 27.4908 3.3205 161.5665 24.4583 51.6754 175.9881 39.8684 6.1680 29.4551 51.0082 5.8138 132.1747 98.4142 166.8602 171.0530 2600.5083 66.9766 7.8842 37.6641 40.4123 21.9634 21.7875 10.6074 7.8813 14.8937 4.3726 16.7481 3.5267 1.3925 4.3044 411.6803 11.7319 167.9867 6.1171 333.8815 53.5476 84.6087 80.7963 110.3071
temp: 298.150 k
press: 1.00000 atm
elementType: 15 15 8 8 8 8 8 8 8 8 8 8 8 8 8 8 8 7 7 6 6 6 6 6 6 6 6 6 6 6 6 6 6 6 6 1 1 1 1 1 1 1 1 1 1 1 1 1 1 1 1 1 1 1 1 1 1 1 1
symmnumber: 1
zpe: 1116711.8 jmol-1
zpe.correction: 0.425333 hartree
zpe.thermalcorrener: 0.461647 hartree
zpe.thermalcorrenthalpy: 0.462591 hartree
zpe.thermalcorrgfe: 0.355147 hartree
zpe.sumelectzpe: -2541.628711 hartree
zpe.sumelectthermal: -2541.592397 hartree
zpe.sumelectthermalent: -2541.591453 hartree
zpe.sumelectthermalfe: -2541.698897 hartree
dipole: -4.3533 3.8917 0.5016
dipole: 5.8607
quadrupole: -266.5185 -236.6946 -218.0705
quadrupole: 0.0930 -5.6555 -22.1455
quadrupole: -26.0906 3.7333 22.3573 0.0930 -5.6555 -22.1455
hfenergy: -2542.0540439 hartree
pointgroup: C01 [X(C16H24N2O15P2)]
dipole: 1.2490667 -0.2675972 1.9195784 debye
polarizability: 360.9621658|27.34468|210.7876653|28.6422669|-54.8186922|337.2492511 unknown
InChI: InChI=1S/C16H24N2O15P2/c17-15(24)8-2-1-3-18(4-8)16-14(23)13(22)11(32-16)6-30-10(12(21)9(20)5-19)7-31-35(28,29)33-34(25,26)27/h1-5,9-14,16,20-22,25-26,28H,6-7,17H2
charge 0 multiplicity 1
59 atoms
P  2.064489 0.904588 -2.114324
P  5.007269 1.759296 -1.353241
O  -1.543523 0.175712 0.756748
O  0.825526 -1.229107 2.143689
O  -4.020394 -1.285199 2.385488
O  -4.773625 -1.24064 -0.224067
O  1.743556 0.846823 3.48433
O  1.473836 -0.43267 -1.21533
O  4.79177 -0.440869 1.746182
O  3.800734 0.705038 -2.049122
O  5.52198 -0.096673 4.197335
O  1.77241 2.200947 -1.036704
O  -6.135782 0.804156 -4.741949
O  1.422728 0.965104 -3.551789
O  4.132277 3.257159 -1.556243
O  4.835855 1.568774 0.285495
O  6.417568 1.698037 -2.053632
N  -2.839465 0.810595 -1.20451
N  -6.36877 -0.401287 -2.735107
C  -1.651535 -0.968411 1.756939
C  -2.983962 -1.709893 1.455787
C  -3.41468 -1.215102 0.031824
C  -2.849796 0.280955 0.163073
C  -0.406551 -1.847039 1.616212
C  1.492794 -0.205368 1.290432
C  2.481132 0.466162 2.280054
C  -4.119971 0.870381 -1.727962
C  -1.727335 0.816771 -2.018712
C  2.136786 -0.857046 0.044715
C  3.66348 -0.466073 2.711357
C  -4.309721 0.776024 -3.115123
C  -1.884953 0.919385 -3.406973
C  -3.187797 0.859523 -3.970996
C  4.268649 -0.110851 4.074517
C  -5.693908 0.424746 -3.616215
H  -1.705707 -0.517005 2.764822
H  -2.862153 -2.811507 1.476544
H  -2.767963 -1.717097 -0.735351
H  -3.550208 0.874745 0.78175
H  -0.267282 -2.147389 0.558886
H  -0.531942 -2.751364 2.236473
H  0.752926 0.552859 0.975334
H  -4.845732 -1.241318 1.803703
H  2.886646 1.390607 1.83545
H  -4.937841 0.92974 -1.01236
H  -0.768639 0.705966 -1.513563
H  1.988584 -1.949115 0.067401
H  3.22033 -0.668956 -0.030182
H  3.278749 -1.506542 2.779949
H  -0.981731 0.969979 -4.020603
H  -3.34158 0.836489 -5.0542
H  1.0115 0.174097 3.578441
H  3.57358 0.101391 4.906631
H  5.625726 -0.487083 2.31782
H  -7.301158 -0.719466 -3.001483
H  -5.903123 -0.815322 -1.902648
H  2.437893 2.958361 -1.143124
H  4.662863 4.039987 -1.842222
H  4.879892 0.659594 0.841957
