program: Gaussian 09
title: 000193658
version: EM64L-G09RevD.01
frameworkgroup: C1[X(C11H13NO4S)]
method: RPBEPBE
basis: SDD
operation: Freq
keyword: #p
keyword: freq=noraman
keyword: PBEPBE/SDD
title: #p freq=noraman PBEPBE/SDD
converged: YES YES NO NO
title: Mulliken charges:
elementType: S O O O O N C C C C C C C C C C C H H H H H H H H H H H H H
charge: 0.198789 -0.226532 -0.438845 -0.203594 -0.216589 -0.626627 -0.096004 -0.694416 0.462959 -0.493329 0.215667 -0.370700 -0.361662 -0.225063 -0.227751 0.060442 -0.230494 0.245024 0.266895 0.324480 0.228077 0.245300 0.235318 0.265133 0.312953 0.279315 0.228139 0.229190 0.230204 0.383721
chargesum: 0.00000
title: Mulliken charges with hydrogens summed into heavy atoms:
elementType: S O O O O N C C C C C C C C C C C
charge: 0.198789 -0.226532 -0.055124 -0.203594 -0.216589 -0.034359 0.149019 -0.103041 0.462959 -0.019952 0.215667 -0.135382 -0.096529 0.003076 0.001439 0.060442 -0.000290
polarizability: 2.13231052e+02 5.74706601e-01 1.28912224e+02 -6.51640966e+00 -1.09793369e+01 1.23530396e+02
1716.lowfreq: -1.8573 -0.0020 -0.0011 0.0010 5.2968 9.8837 19.8191 24.8225 35.6745
frequency: 19.7706 23.1120 35.5785 40.2617 45.0078 62.1783 99.3475 135.1311 156.4205 192.1485 217.1782 256.1935 258.7252 273.6631 304.4678 340.5695 373.4336 403.8174 417.3651 454.9897 479.1348 494.2856 529.7992 579.3805 580.1289 617.4473 617.8013 624.8197 679.4182 702.7095 728.8622 740.4418 755.5947 764.2815 816.5214 846.6834 856.8023 920.9028 935.0692 973.5763 981.0232 990.3887 1000.3761 1008.5567 1027.3203 1041.3364 1060.0690 1091.9759 1103.3572 1168.9233 1174.0101 1190.2769 1210.9552 1223.1995 1228.9769 1255.2404 1261.2811 1306.5565 1330.7216 1339.4981 1386.3588 1386.4825 1440.0894 1443.0962 1463.1295 1485.3941 1594.9583 1615.0375 1624.7335 1630.4260 1686.1059 2858.8682 3035.9684 3044.5436 3116.4907 3120.2043 3122.9873 3130.0414 3142.1875 3153.3132 3166.5386 3474.8061 3520.1876 3608.2540
redmass: 6.7526 5.8592 5.7740 9.7135 4.6453 6.2997 9.3790 8.2843 6.1579 4.5191 5.7223 5.0943 1.3906 3.1351 2.6414 2.8619 2.8540 2.8149 4.6427 7.7654 4.6842 4.2975 4.1076 3.1768 1.5978 6.6542 8.0600 1.3947 3.8307 1.8181 4.4900 5.2757 2.1789 2.8195 3.6089 5.4633 1.2930 1.8543 1.4817 1.7920 1.4078 5.4932 1.3435 3.9706 2.2238 2.7275 4.5706 1.5151 2.2742 1.1123 1.0538 1.1190 1.4880 2.6861 1.1766 1.1566 1.6944 1.3647 1.2602 1.2434 2.1644 5.5246 1.0891 2.1838 1.1339 2.3048 6.1130 6.0844 8.7534 1.1117 9.4582 1.0796 1.0580 1.0585 1.1074 1.1055 1.0886 1.0880 1.0922 1.0965 1.1016 1.0447 1.0641 1.0990
irintensity: 2.2106 0.4704 0.1885 0.3866 0.4618 1.2331 1.5303 0.7355 0.9757 1.4811 5.2154 9.5743 38.9081 14.5123 11.5659 2.4133 37.7726 0.0980 5.8027 7.3713 47.2571 22.3249 5.4737 16.6556 20.6310 4.1985 18.5335 323.1522 62.5267 57.6925 63.1579 29.9811 33.6381 4.5139 11.0773 26.3099 1.8429 4.6804 2.1790 2.5211 0.2594 3.2841 0.8249 133.4630 24.6109 666.0735 413.8038 7.0699 15.0751 2.2273 0.0574 0.1720 1.2631 22.0780 13.3550 3.3795 18.5696 14.9278 1.0313 13.5592 6.6609 2.3445 20.7296 9.7193 18.3509 6.5635 2.3877 0.7235 141.5004 59.2270 200.8044 52.0498 22.3440 28.7102 2.9539 2.9884 4.7900 2.0275 19.8498 27.7207 19.5599 7.4664 26.6920 8.3932
temp: 298.150 k
press: 1.00000 atm
elementType: 16 8 8 8 8 7 6 6 6 6 6 6 6 6 6 6 6 1 1 1 1 1 1 1 1 1 1 1 1 1
symmnumber: 1
zpe: 595723.9 jmol-1
zpe.correction: 0.226899 hartree
zpe.thermalcorrener: 0.244355 hartree
zpe.thermalcorrenthalpy: 0.245299 hartree
zpe.thermalcorrgfe: 0.177957 hartree
zpe.sumelectzpe: -1179.404471 hartree
zpe.sumelectthermal: -1179.387015 hartree
zpe.sumelectthermalent: -1179.386071 hartree
zpe.sumelectthermalfe: -1179.453413 hartree
dipole: 1.1359 0.3261 0.7106
dipole: 1.3789
quadrupole: -75.2448 -97.2915 -109.2486
quadrupole: 0.4667 0.4854 2.2093
quadrupole: 18.6835 -3.3631 -15.3203 0.4667 0.4854 2.2093
hfenergy: -1179.6313698 hartree
pointgroup: C01 [X(C11H13N1O4S1)]
dipole: -0.4810611 -0.1236625 -0.218203 debye
polarizability: 210.090821|-13.8184927|136.8425494|-11.450563|-5.6944456|118.7403024 unknown
InChI: InChI=1S/C11H13NO4S/c12-9(10(13)14)7-17-11(15)16-6-8-4-2-1-3-5-8/h1-5,9,13H,6-7,12H2
charge 0 multiplicity 1
30 atoms
S  -1.590705 -0.932198 -0.8926
O  0.59741 -1.280843 0.494781
O  -5.377045 0.374405 1.569068
O  -3.070511 0.340962 1.83346
O  -0.078211 0.96605 0.447006
N  -4.95486 1.491454 -0.90185
C  -4.07302 0.39683 -0.454613
C  -2.659888 0.6223 -1.029619
C  2.984312 -0.514383 0.404765
C  1.831033 -0.903896 1.299099
C  -4.058045 0.374383 1.077417
C  3.864507 -1.505145 -0.101041
C  3.204132 0.845956 0.065567
C  4.945373 -1.145366 -0.935654
C  4.286228 1.206831 -0.767156
C  -0.231744 -0.23198 0.140295
C  5.158958 0.212883 -1.269006
H  -4.430165 -0.618989 -0.762303
H  -2.727845 0.868855 -2.101492
H  -2.126901 1.42826 -0.499402
H  2.028337 -1.832028 1.856954
H  1.541912 -0.090018 1.985145
H  3.698276 -2.558319 0.156732
H  2.515786 1.609697 0.444013
H  -5.829867 1.562343 -0.37511
H  -5.082966 1.535789 -1.916185
H  5.620049 -1.91758 -1.321571
H  4.448909 2.259387 -1.024128
H  5.99921 0.49412 -1.913915
H  -5.357555 0.35744 2.563945
