program: Gaussian 09
title: 000193656
version: EM64L-G09RevD.01
frameworkgroup: C1[X(C20H24N6O5)]
method: RPBEPBE
basis: SDD
operation: Freq
keyword: #p
keyword: freq=noraman
keyword: PBEPBE/SDD
title: #p freq=noraman PBEPBE/SDD
converged: YES YES NO NO
title: Mulliken charges:
elementType: O O O O O N N N N N N C C C C C C C C C C C C C C C C C C C C H H H H H H H H H H H H H H H H H H H H H H H H
charge: -0.271334 -0.268820 -0.360243 -0.217093 -0.215014 -0.377598 -0.450630 -0.094990 -0.638415 -0.682503 0.020124 -0.282315 -0.429730 -0.424774 0.218507 -0.510845 0.350558 0.479649 -0.320762 -0.426523 -0.479478 0.470540 -0.361440 -0.341844 0.206585 0.393016 -0.383255 -0.365632 -0.223591 -0.225977 -0.229563 0.295405 0.236741 0.219737 0.231271 0.219686 0.182752 0.225800 0.362916 0.375408 0.305060 0.256685 0.229373 0.243939 0.285755 0.287517 0.235283 0.265904 0.231380 0.231059 0.318866 0.286264 0.388067 0.295028 0.233494
chargesum: 0.00000
title: Mulliken charges with hydrogens summed into heavy atoms:
elementType: O O O O O N N N N N N C C C C C C C C C C C C C C C C C C C C
charge: -0.271334 -0.268820 -0.360243 -0.217093 -0.215014 -0.014683 -0.075222 -0.094990 -0.033285 0.000592 0.020124 0.013090 0.026747 0.026183 0.218507 -0.102292 0.350558 0.479649 -0.015702 -0.169838 -0.006165 0.470540 -0.075685 -0.054328 0.206585 0.393016 -0.147972 -0.099729 0.007789 0.005083 0.003931
polarizability: 3.79563362e+02 -3.61404711e+01 3.28311826e+02 2.74581736e+01 8.51485209e-02 1.97744001e+02
1716.lowfreq: -3.0868 -0.0008 -0.0007 0.0002 3.0489 4.3702 18.3097 20.2561 23.7086
frequency: 18.2286 20.1740 23.6495 29.7781 31.8233 36.0060 42.9370 48.9501 65.4118 75.9317 88.6649 101.1921 110.3224 114.0568 134.8109 144.6607 162.5011 174.7886 187.3898 203.8032 214.0989 248.3943 262.7203 273.7051 281.9883 299.6451 303.3138 317.5508 336.8690 359.0462 369.1592 384.5389 403.3855 405.0636 417.4866 433.6386 445.3231 475.8072 497.1541 509.1720 512.9195 528.1769 549.3921 584.0734 592.3583 604.4284 617.5047 619.8270 634.8944 643.7451 663.0614 669.2614 680.7752 690.2614 698.5499 705.5518 740.5971 757.5031 760.6609 764.3633 785.2502 816.4039 828.1837 837.2323 845.6995 855.6631 858.7920 875.1390 879.0871 908.1130 934.5764 937.5166 947.2538 965.4066 982.7661 986.8719 989.0901 991.0855 1000.0839 1002.5024 1007.5996 1015.9682 1027.4801 1030.6294 1037.9577 1068.5154 1092.0796 1096.0219 1104.3132 1119.0955 1126.0872 1167.4405 1175.0351 1177.3131 1184.2014 1190.2101 1211.9771 1223.1628 1224.2464 1226.4491 1235.7998 1272.4622 1275.8173 1288.4777 1292.3342 1300.6410 1307.5806 1331.7951 1339.0147 1349.1107 1353.5671 1356.5333 1362.2761 1386.6569 1396.0134 1415.2559 1431.2886 1443.5216 1457.9463 1459.5764 1471.5166 1484.8662 1487.0070 1489.5570 1497.1052 1554.7948 1586.1148 1594.1928 1595.7262 1599.9465 1615.0518 1617.6189 1635.5240 1652.7072 1669.0429 2894.1673 2984.3823 2993.2384 3002.0187 3011.9391 3042.7993 3046.5545 3063.2929 3118.6550 3122.4960 3129.9932 3141.4981 3142.1709 3151.4133 3153.3782 3167.0270 3178.5336 3186.5224 3206.4011 3485.5766 3526.4480 3551.0641 3641.7083 3675.1350
redmass: 6.5580 5.8385 6.1890 4.9548 5.6886 5.6082 4.4775 4.9444 7.2086 5.9457 7.1545 5.5034 5.7632 5.4338 5.6538 7.1847 5.3403 6.0284 6.7641 4.5477 3.4473 4.8133 1.4747 6.4239 3.6067 2.0717 5.0867 2.8245 4.9507 4.3197 2.7501 3.6097 2.6564 2.7984 3.0214 2.3300 3.1190 1.9389 4.1084 6.6138 3.3385 4.0385 1.3405 1.3977 2.8386 2.6415 6.3786 6.1497 5.7744 6.0575 1.3744 4.3222 5.1891 4.4438 6.0105 2.0306 4.5944 2.4341 1.7727 4.8698 2.8110 3.5374 5.0866 1.5565 3.0306 2.1568 1.4877 1.9455 2.1209 3.0059 1.5382 1.4338 2.0115 2.1919 1.4900 2.1515 1.6163 5.2588 3.0107 1.3301 1.3452 2.1469 2.2920 3.0288 1.6001 2.5593 1.5193 3.1623 2.0371 1.3189 2.7719 1.7294 1.0543 1.8555 1.9802 1.1213 1.9008 2.8013 1.9176 3.1522 1.1686 1.5335 1.3165 1.8913 1.1703 1.4545 1.4595 1.2581 1.3780 1.3223 1.2777 5.0514 1.3715 8.1044 6.6736 3.8343 4.5790 2.1839 1.0825 1.1546 1.4918 1.7182 1.6932 2.6058 1.1136 3.0556 6.8531 5.3159 6.0142 1.4705 6.0437 6.0171 2.0549 1.9514 1.5379 1.0700 1.0784 1.0605 1.0660 1.0900 1.0587 1.1003 1.1035 1.1061 1.0888 1.0872 1.0911 1.0919 1.0866 1.0961 1.1016 1.0908 1.0949 1.0953 1.0503 1.0451 1.0775 1.0999 1.1019
irintensity: 0.1313 0.3729 0.6727 0.0830 0.8429 1.0569 0.6765 0.5502 1.7739 0.4782 2.2802 8.8601 3.0541 2.9862 11.8077 5.8694 2.9703 2.1790 2.1984 1.8944 2.2388 6.7750 64.6930 29.1925 1.1473 15.1483 3.5035 11.3650 2.5645 13.9175 6.8654 41.5272 76.1487 5.2608 0.0477 29.8383 7.1255 48.2017 3.8388 0.8888 16.3810 16.0651 145.1770 89.1554 15.6824 15.6526 0.6347 0.0635 0.2271 5.9781 146.9417 38.8416 4.9610 126.7858 27.0940 58.2916 2.0372 50.7768 3.7042 58.2055 8.4312 9.6221 13.8495 1.4028 29.4783 13.2044 5.6945 35.8339 20.2127 34.1841 76.9374 132.8141 48.6986 18.2874 7.1624 73.0361 15.0694 9.2793 0.1160 0.4752 0.2648 50.6557 11.7186 25.7826 2.8219 34.9266 8.1859 23.4000 11.4892 20.2849 15.3733 2.5109 0.0554 331.6168 3.8210 9.0610 433.2789 31.1600 114.2181 244.8234 19.6715 14.5250 49.1213 47.8825 15.0717 45.4009 54.7237 3.2513 5.8786 38.2506 2.1648 55.3617 49.5877 0.8571 128.8356 148.9111 27.9568 10.4262 24.8428 26.0350 318.6452 62.5515 233.9493 48.1338 5.6404 652.5491 127.5965 364.8263 6.7564 32.4492 0.4607 73.6749 301.7082 123.7136 290.8529 72.6952 4.7779 29.5106 32.3424 25.8668 27.0507 18.2968 56.1229 4.2071 7.0131 0.4828 0.1393 16.9629 771.3113 12.1714 15.8834 1.9994 3.1970 2.1367 228.0715 20.3588 73.2423 76.4607 20.0993
temp: 298.150 k
press: 1.00000 atm
elementType: 8 8 8 8 8 7 7 7 7 7 7 6 6 6 6 6 6 6 6 6 6 6 6 6 6 6 6 6 6 6 6 1 1 1 1 1 1 1 1 1 1 1 1 1 1 1 1 1 1 1 1 1 1 1 1
symmnumber: 1
zpe: 1136610.3 jmol-1
zpe.correction: 0.432912 hartree
zpe.thermalcorrener: 0.462621 hartree
zpe.thermalcorrenthalpy: 0.463565 hartree
zpe.thermalcorrgfe: 0.367988 hartree
zpe.sumelectzpe: -1478.840127 hartree
zpe.sumelectthermal: -1478.810418 hartree
zpe.sumelectthermalent: -1478.809474 hartree
zpe.sumelectthermalfe: -1478.905051 hartree
dipole: -7.2086 1.4059 0.3719
dipole: 7.3538
quadrupole: -189.2834 -220.2176 -172.2651
quadrupole: 35.5891 2.4284 10.7056
quadrupole: 4.6386 -26.2956 21.6569 35.5891 2.4284 10.7056
hfenergy: -1479.273039 hartree
pointgroup: C01 [X(C20H24N6O5)]
dipole: -2.885668 0.0934381 -0.1867054 debye
polarizability: 393.20924|25.1743053|311.2663247|-19.8574724|23.0733256|201.1436251 unknown
InChI: InChI=1S/C20H24N6O5/c21-19(22)23-12-4-7-17(25-20(28)31-13-14-5-2-1-3-6-14)18(27)24-15-8-10-16(11-9-15)26(29)30/h1-3,5-6,8-11,17,24-25H,4,7,12-13,21-22H2
charge 0 multiplicity 1
55 atoms
O  1.516973 -2.171721 0.716987
O  -2.877099 0.657964 -1.109745
O  -1.469884 1.33023 0.660677
O  6.040189 4.039107 0.246201
O  7.117491 2.028952 0.141235
N  -1.659775 -0.906478 0.00847
N  1.030696 0.121081 0.905388
N  0.123623 -5.951622 -0.799278
N  1.499467 -6.232132 -2.673135
N  2.059667 -4.510859 -1.165283
N  6.047064 2.745132 0.262244
C  -0.841791 -1.457733 1.114109
C  -1.16555 -2.950346 1.321114
C  -0.974652 -3.833234 0.054035
C  0.688416 -1.22483 0.880093
C  -0.259156 -5.174225 0.391263
C  -1.970352 0.423815 -0.086966
C  2.30333 0.712338 0.737083
C  3.508346 -0.037187 0.607388
C  2.35162 2.137797 0.711272
C  -3.330528 2.090202 -1.286744
C  -4.574596 2.376742 -0.477898
C  4.732958 0.634503 0.452885
C  3.572937 2.808017 0.557251
C  1.18164 -5.55732 -1.480985
C  4.757684 2.046595 0.427218
C  -5.858756 2.215621 -1.057303
C  -4.470581 2.810676 0.869566
C  -7.023441 2.479441 -0.302847
C  -5.634443 3.073267 1.624656
C  -6.912595 2.90893 1.040279
H  -1.109617 -0.888164 2.027234
H  -2.199875 -3.028371 1.705222
H  -0.497281 -3.317491 2.122335
H  -0.357857 -3.30191 -0.694396
H  -1.944616 -4.063603 -0.427312
H  0.611234 -4.931331 1.046842
H  -0.941154 -5.802971 0.994522
H  -2.062555 -1.554141 -0.672272
H  0.219588 0.772882 0.997825
H  3.466778 -1.126448 0.633617
H  1.422775 2.710653 0.81122
H  -3.515721 2.148647 -2.3702
H  -2.489003 2.742485 -0.998486
H  5.671724 0.083172 0.353758
H  3.630282 3.899061 0.534029
H  -5.945155 1.881975 -2.098726
H  -3.477555 2.927998 1.317926
H  -8.011571 2.354629 -0.759087
H  -5.546923 3.409144 2.663783
H  0.880495 -7.012263 -2.888301
H  2.471925 -6.306274 -2.968006
H  1.883829 -3.90166 -0.362902
H  2.701701 -4.162208 -1.873846
H  -7.815156 3.116664 1.625893
