program: Gaussian 09
title: 000193651
version: EM64L-G09RevD.01
frameworkgroup: C1[X(C13H19NO5)]
method: RPBEPBE
basis: SDD
operation: Freq
keyword: #p
keyword: freq=noraman
keyword: PBEPBE/SDD
title: #p freq=noraman PBEPBE/SDD
converged: YES YES NO NO
title: Mulliken charges:
elementType: O O O O O N C C C C C C C C C C C C C H H H H H H H H H H H H H H H H H H H
charge: -0.281280 -0.463237 -0.459584 -0.454931 -0.440065 -0.433339 -0.162084 -0.089381 -0.168987 -0.039035 -0.104617 -0.370542 0.446247 -0.429138 -0.337866 -0.365606 -0.400141 0.438969 -0.807430 0.230736 0.222067 0.224740 0.228653 0.217679 0.188785 0.249164 0.293201 0.369779 0.365482 0.357546 0.354829 0.225031 0.250820 0.229452 0.231138 0.235382 0.222490 0.225072
chargesum: 0.00000
title: Mulliken charges with hydrogens summed into heavy atoms:
elementType: O O O O O N C C C C C C C C C C C C C
charge: -0.281280 -0.093459 -0.094102 -0.097385 -0.085236 -0.140137 0.068652 0.132685 0.055753 0.189617 0.113062 0.067407 0.446247 -0.204107 -0.087046 -0.136154 -0.169003 0.438969 -0.124486
polarizability: 2.35979023e+02 5.16844903e+00 1.50977814e+02 1.65380226e-01 -1.80396960e+01 1.17926203e+02
1716.lowfreq: -48.0575 -6.2183 -0.0009 -0.0006 0.0003 2.5587 14.0449 27.1800 37.8780
frequency: -47.8783 27.0850 37.7199 45.2637 79.1052 91.3970 106.6015 127.2503 145.2712 178.1947 195.1242 217.6061 239.3238 248.4706 280.4271 321.3743 327.4073 339.6276 378.3266 388.5167 407.0343 413.2767 421.1042 428.7466 450.3089 466.1355 477.0652 484.1468 506.5624 544.6422 560.1457 583.6671 609.4533 618.5572 644.5856 710.9812 760.5866 814.1597 823.1424 835.1918 853.3890 910.0483 936.0936 950.4154 958.9058 966.9092 981.2958 985.4885 1005.8812 1013.8884 1032.9065 1046.5684 1046.9273 1053.4953 1067.6564 1092.0636 1106.3297 1126.5250 1160.7665 1182.4905 1193.0310 1196.8591 1211.0004 1224.3243 1225.5291 1250.4075 1266.4093 1279.3332 1286.8598 1297.8323 1305.6744 1316.7601 1320.4422 1341.5288 1346.0807 1371.2361 1378.8591 1384.5993 1394.0663 1398.0149 1398.8348 1415.6384 1463.3341 1469.1691 1472.0782 1491.0985 1516.5671 1593.9153 1632.5510 2952.2162 2955.6229 2957.9164 2966.9604 2972.4989 2978.3402 2987.8566 3052.8065 3082.1966 3108.8351 3111.6819 3124.2124 3136.8345 3157.3811 3509.5720 3530.0418 3531.9329 3544.4319 3566.0688
redmass: 1.0129 5.0476 4.2700 5.1860 5.6592 4.7210 6.3985 4.2195 4.8017 3.3672 4.0577 4.2045 4.2667 3.7577 4.2940 3.3573 3.7940 2.6787 3.2124 2.3232 2.6499 2.2008 1.5294 1.4547 1.3472 2.9447 2.4646 1.8181 2.1571 2.2752 3.5165 3.3878 3.9428 3.4804 5.9209 2.9390 3.9137 1.6710 1.3150 3.3034 3.0803 7.4683 1.3444 5.2217 1.3836 5.7474 3.5377 1.4432 2.8073 2.9425 3.2444 1.5781 2.7926 2.9908 2.4078 4.4723 2.1954 1.3427 1.5311 1.4503 1.3070 1.2846 1.2322 1.2171 2.5297 1.2011 1.3572 1.2570 2.0030 1.2554 1.2733 1.2939 1.2594 1.2202 1.6761 2.0885 1.5615 1.7692 1.4169 1.2651 1.7646 3.2317 1.0824 1.1478 1.0522 1.4524 2.8751 5.1755 6.4810 1.0809 1.0769 1.0804 1.0803 1.0388 1.0839 1.0855 1.0951 1.0995 1.0939 1.0871 1.0890 1.0965 1.0952 1.0752 1.0653 1.0655 1.0656 1.0657
irintensity: 0.5622 0.4695 0.2786 0.2753 0.3948 6.2046 2.2025 0.9596 0.5746 3.2440 13.2110 3.6651 13.2174 11.3296 5.4848 5.1184 27.0484 11.4779 17.1299 37.1773 12.1546 28.9514 50.2886 130.4367 223.3255 29.4479 85.9962 88.5436 53.8112 45.6849 68.8865 20.5733 17.2836 4.2862 4.8451 0.5082 0.8376 54.2670 2.9386 13.6578 42.3533 268.7862 8.4795 58.0495 0.7077 126.2668 4.5920 0.6923 6.0466 54.6527 14.3617 28.8230 16.5681 197.0881 38.7554 16.1458 15.3381 9.7428 13.2185 35.6432 4.9994 32.7622 14.0685 21.1574 5.6968 10.4972 37.7499 36.8538 113.7161 58.7753 22.6764 3.0649 9.9522 14.5014 12.4478 7.0055 7.7716 23.6477 2.5833 5.3942 30.1809 2.6174 4.5218 34.7328 12.4247 26.8728 250.4072 6.6927 51.8673 4.4924 18.4189 9.7686 4.1484 47.7555 23.5497 163.5405 24.2083 18.8150 12.7907 16.3718 21.0365 26.8363 11.3439 11.0972 11.7086 19.2217 19.5414 22.8624
temp: 298.150 k
press: 1.00000 atm
elementType: 8 8 8 8 8 7 6 6 6 6 6 6 6 6 6 6 6 6 6 1 1 1 1 1 1 1 1 1 1 1 1 1 1 1 1 1 1 1
symmnumber: 1
zpe: 810356.8 jmol-1
zpe.correction: 0.308649 hartree
zpe.thermalcorrener: 0.327361 hartree
zpe.thermalcorrenthalpy: 0.328306 hartree
zpe.thermalcorrgfe: 0.261403 hartree
zpe.sumelectzpe: -936.159119 hartree
zpe.sumelectthermal: -936.140406 hartree
zpe.sumelectthermalent: -936.139462 hartree
zpe.sumelectthermalfe: -936.206365 hartree
dipole: 2.2769 -3.9172 0.9980
dipole: 4.6395
quadrupole: -108.2060 -124.1108 -109.9250
quadrupole: 4.9416 -0.1105 -4.8095
quadrupole: 5.8746 -10.0302 4.1556 4.9416 -0.1105 -4.8095
hfenergy: -936.4677675 hartree
pointgroup: C01 [X(C13H19N1O5)]
dipole: -0.8698026 -1.5532621 -0.4032973 debye
polarizability: 236.1284412|-3.7419297|150.5824982|-0.1480936|18.2607214|118.1721002 unknown
InChI: InChI=1S/C13H19NO5/c1-7-2-4-8(5-3-7)14-13-12(18)11(17)10(16)9(6-15)19-13/h2-5,9-18H,6H2,1H3
charge 0 multiplicity 1
38 atoms
O  0.997748 0.776545 -0.573402
O  4.215751 -1.808676 0.190606
O  4.504943 1.009099 0.680201
O  1.519589 -2.811715 0.485144
O  1.137648 3.554839 -0.302134
N  -0.577374 -1.0425 -0.642486
C  3.045693 -0.96906 0.470793
C  3.382931 0.43234 -0.059851
C  1.776196 -1.528975 -0.180743
C  2.171544 1.362562 0.130139
C  0.596811 -0.546266 0.006355
C  2.351034 2.755283 -0.479518
C  -1.896829 -0.608809 -0.316742
C  -2.99943 -1.227134 -0.962665
C  -2.149756 0.399826 0.648226
C  -4.318573 -0.84832 -0.643872
C  -3.47782 0.753468 0.969761
C  -4.58843 0.14537 0.333045
C  -6.012495 0.563637 0.656842
H  2.873074 -0.912834 1.568443
H  3.626739 0.347884 -1.141546
H  1.948789 -1.677312 -1.270212
H  1.941653 1.4583 1.213697
H  0.39613 -0.413398 1.090586
H  2.613332 2.655591 -1.554791
H  3.158664 3.29062 0.041804
H  -0.442573 -1.362439 -1.605926
H  4.012772 -2.728456 0.499262
H  5.230986 0.332356 0.684657
H  0.601917 -3.105559 0.245781
H  0.382778 3.009879 -0.648369
H  -2.821763 -2.016779 -1.703733
H  -1.321805 0.930405 1.128123
H  -5.154127 -1.34164 -1.155605
H  -3.650685 1.534114 1.720717
H  -6.361149 1.364976 -0.023802
H  -6.716372 -0.281523 0.55348
H  -6.096242 0.950701 1.687633
