program: Gaussian 09
title: 000193637
version: EM64L-G09RevD.01
frameworkgroup: C1[X(C13H15NO8)]
method: RPBEPBE
basis: SDD
operation: Freq
keyword: #p
keyword: freq=noraman
keyword: PBEPBE/SDD
title: #p freq=noraman PBEPBE/SDD
converged: YES YES NO NO
title: Mulliken charges:
elementType: O O O O O O O O N C C C C C C C C C C C C C H H H H H H H H H H H H H H H
charge: -0.228373 -0.461264 -0.277408 -0.468029 -0.445938 -0.478465 -0.159340 -0.313503 -0.682303 -0.150738 -0.159618 -0.087756 -0.089834 0.007993 0.147814 0.252561 0.071715 0.334746 -0.305249 -0.397726 -0.266789 -0.192390 0.228359 0.244165 0.241270 0.249490 0.241346 0.370676 0.382683 0.366500 0.401199 0.268855 0.219530 0.230475 0.225371 0.376657 0.303315
chargesum: 0.00000
title: Mulliken charges with hydrogens summed into heavy atoms:
elementType: O O O O O O O O N C C C C C C C C C C C C C
charge: -0.228373 -0.090588 -0.277408 -0.085345 -0.079438 -0.077266 -0.159340 -0.313503 -0.002330 0.077621 0.084547 0.153515 0.159656 0.249339 0.147814 0.252561 0.071715 0.334746 -0.036395 -0.178195 -0.036314 0.032981
polarizability: 2.49662931e+02 -9.12130381e+00 1.46345018e+02 -1.17250837e+01 -1.85276153e+01 1.50766102e+02
1716.lowfreq: -5.7639 -0.0007 0.0001 0.0005 1.5347 5.3696 20.3910 24.5943 30.5638
frequency: 20.3389 24.5508 30.5524 46.2534 71.5953 82.9736 98.4514 129.1138 143.7032 160.9398 180.8672 218.9900 232.1803 254.0269 270.5243 277.9273 304.6004 326.4679 353.3258 387.2965 398.2145 404.3607 417.5961 424.5587 426.7299 440.7255 473.3233 483.2711 514.1020 519.6519 524.2101 538.0717 546.5662 561.3283 590.4521 609.5851 623.2508 658.6146 674.3247 686.3578 717.7005 758.8155 770.4316 777.9906 840.5865 855.3408 868.8179 930.1840 952.4182 963.7325 966.5049 982.6618 985.1569 1013.3777 1021.6918 1023.9171 1038.3867 1050.9320 1056.3575 1061.4333 1071.2773 1085.9517 1099.5536 1154.4994 1175.9832 1179.9319 1217.0914 1222.8021 1229.2956 1251.7343 1254.4827 1273.5348 1287.4138 1298.3496 1304.0401 1307.0277 1332.4512 1334.9504 1351.2134 1381.8433 1399.5548 1402.3866 1406.7970 1448.4259 1488.1366 1549.7135 1583.5509 1628.2985 1639.8972 1709.2591 2928.5520 2958.4274 2988.5876 2994.9695 3008.4625 3120.7955 3142.1691 3161.1160 3184.6111 3424.0466 3483.2187 3521.9444 3544.1417 3559.7218 3650.7618
redmass: 5.3922 7.4064 9.6551 7.5204 6.5451 6.7558 7.6443 6.6293 6.0926 7.3048 6.4113 4.8619 4.4016 4.5521 5.8119 5.2502 6.5224 7.4146 6.4367 4.1802 2.6863 7.0061 1.4459 3.1432 3.3192 1.2912 1.2336 3.8691 3.2783 1.8547 2.8474 2.3688 4.3517 4.1716 2.3452 3.2300 2.7522 6.1544 4.5740 4.0879 1.1947 1.7741 6.7448 2.0061 5.9206 1.5454 6.3510 6.6675 6.6823 1.3690 6.2309 6.7530 1.3389 5.1717 3.2200 2.5939 4.0199 3.8981 1.8809 2.4623 2.8804 3.1295 3.0194 1.2997 1.0602 1.3263 1.2833 1.2213 1.2144 1.6882 1.8093 1.4194 1.8153 1.3481 1.1961 1.2130 1.9164 1.2916 1.3625 1.8126 1.9189 1.5280 4.1292 2.9486 2.6387 3.4487 6.5850 1.7348 5.0496 9.8771 1.0802 1.0818 1.0845 1.0846 1.0852 1.0865 1.0926 1.0935 1.0973 1.0546 1.0653 1.0643 1.0656 1.0656 1.0959
irintensity: 0.1815 2.4198 2.8246 0.1664 2.1046 1.4658 2.5612 0.3645 0.0077 5.1577 1.7340 6.0659 2.5469 4.9702 7.4440 7.9886 13.7998 1.8825 1.1734 12.6919 40.7265 3.5127 76.2932 16.3239 11.9430 180.1030 105.2050 8.9582 25.7263 78.1271 34.7465 46.0144 29.3775 57.3635 121.3904 41.2137 75.0854 8.5936 15.4677 21.2773 111.4355 109.7582 35.6937 0.0914 11.6098 2.3826 11.8237 122.7212 15.6583 2.6300 22.4992 1132.4650 4.8086 70.5473 58.9619 24.4111 48.5839 2.8545 29.8065 33.1602 10.8714 14.2272 253.8006 19.5948 33.0785 11.8473 16.4327 6.7746 30.3907 158.6106 233.7727 6.9067 3.3154 71.1747 32.0696 11.4399 11.3341 38.3070 11.2945 7.1047 18.4662 21.9291 8.5576 2.7941 62.8318 216.9011 136.1088 151.3289 211.5853 218.2931 18.2670 14.8912 11.2880 20.8704 66.4016 7.7252 25.0102 17.1471 9.6378 100.8149 96.7192 33.7499 21.0898 28.0692 59.9614
temp: 298.150 k
press: 1.00000 atm
elementType: 8 8 8 8 8 8 8 8 7 6 6 6 6 6 6 6 6 6 6 6 6 6 1 1 1 1 1 1 1 1 1 1 1 1 1 1 1
symmnumber: 1
zpe: 726775.6 jmol-1
zpe.correction: 0.276814 hartree
zpe.thermalcorrener: 0.297579 hartree
zpe.thermalcorrenthalpy: 0.298523 hartree
zpe.thermalcorrgfe: 0.225677 hartree
zpe.sumelectzpe: -1159.270619 hartree
zpe.sumelectthermal: -1159.249854 hartree
zpe.sumelectthermalent: -1159.248910 hartree
zpe.sumelectthermalfe: -1159.321756 hartree
dipole: -1.8439 -1.6191 0.4325
dipole: 2.4916
quadrupole: -86.7352 -128.7611 -123.2007
quadrupole: 4.3285 5.4995 -6.6433
quadrupole: 26.1638 -15.8621 -10.3017 4.3285 5.4995 -6.6433
hfenergy: -1159.547433 hartree
pointgroup: C01 [X(C13H15N1O8)]
dipole: 0.747839 -0.6334036 0.0225037 debye
polarizability: 249.4973836|8.5503862|157.0688994|-13.0521357|16.4623979|140.2077688 unknown
InChI: InChI=1S/C13H15NO8/c14-6-4-2-1-3-5(6)12(20)22-13-9(17)7(15)8(16)10(21-13)11(18)19/h1-4,7-10,13,15-18H,14H2
charge 0 multiplicity 1
37 atoms
O  1.357696 -0.510833 0.484218
O  3.607627 2.872765 -0.509815
O  -0.61093 0.611057 -0.004475
O  4.963149 0.360712 -0.255092
O  0.892801 2.678929 -1.387319
O  4.626456 -2.004066 1.051412
O  2.518419 -2.639326 1.803293
O  -1.279534 -1.028973 -1.534752
N  -3.870744 -1.744912 -1.536513
C  2.961433 1.568353 -0.669622
C  3.597916 0.511411 0.244474
C  1.469226 1.795946 -0.379077
C  2.749581 -0.796244 0.138207
C  0.740774 0.448801 -0.462848
C  3.207407 -1.901807 1.088501
C  -1.589372 -0.236359 -0.597066
C  -2.917995 -0.056736 -0.011808
C  -4.029796 -0.834085 -0.513346
C  -3.1321 0.87283 1.048723
C  -5.316174 -0.636526 0.082862
C  -4.400046 1.05037 1.617304
C  -5.493625 0.284732 1.123121
H  3.075879 1.215766 -1.719206
H  3.587071 0.861867 1.298021
H  1.353465 2.214491 0.642013
H  2.842444 -1.181414 -0.904624
H  0.755962 0.028526 -1.489251
H  4.578238 2.74884 -0.67098
H  5.381178 -0.40658 0.221902
H  1.468425 3.48665 -1.428047
H  4.921037 -2.742331 1.650057
H  -2.27339 1.445851 1.407556
H  -6.166827 -1.220662 -0.288565
H  -4.548913 1.766857 2.43052
H  -6.490667 0.414169 1.560097
H  -2.934982 -1.866794 -1.939064
H  -4.664689 -2.284673 -1.870911
