program: Gaussian 09
title: 000193631
version: EM64L-G09RevD.01
frameworkgroup: C1[X(C9H8O4)]
method: RPBEPBE
basis: SDD
operation: Freq
keyword: #p
keyword: freq=noraman
keyword: PBEPBE/SDD
title: #p freq=noraman PBEPBE/SDD
converged: YES YES NO YES
title: Mulliken charges:
elementType: O O O O C C C C C C C C C H H H H H H H H
charge: -0.438158 -0.434327 -0.433715 -0.252273 0.586329 -0.550925 -0.591271 0.356767 0.344554 -0.533175 -0.252846 -0.309667 0.154361 0.264108 0.225690 0.253406 0.266349 0.244893 0.360256 0.361224 0.378421
chargesum: 0.00000
title: Mulliken charges with hydrogens summed into heavy atoms:
elementType: O O O O C C C C C C C C C
charge: -0.077902 -0.073103 -0.055294 -0.252273 0.586329 -0.286817 -0.365582 0.356767 0.344554 -0.279769 0.013503 -0.064774 0.154361
polarizability: 2.15344520e+02 -7.07266691e+00 1.25163652e+02 -2.76391338e-04 7.10753639e-03 4.51108117e+01
1716.lowfreq: -7.7478 0.0004 0.0006 0.0008 3.1394 8.3163 37.3558 76.8885 80.5724
frequency: 37.3177 76.8881 80.5689 153.5643 205.2036 213.5218 230.7133 265.0914 286.1897 325.6073 363.8611 378.9509 440.5569 502.5977 517.0649 545.6888 550.2332 564.8062 592.0153 604.7881 669.4161 681.8939 707.4754 824.3357 842.7476 864.8572 896.8674 933.2037 971.2940 980.5190 996.4419 1012.1376 1055.7826 1128.0544 1146.2652 1173.2485 1190.0267 1227.6612 1275.4634 1315.4904 1321.6242 1364.1729 1413.8068 1464.0438 1493.2721 1606.2334 1622.3284 1631.6237 1652.2708 3108.9605 3134.3250 3151.2336 3164.0343 3167.5972 3525.4211 3585.6316 3585.8569
redmass: 7.3184 6.6888 6.7688 2.9757 8.4407 5.3833 3.8811 7.2105 2.8270 5.2995 1.1330 1.1068 4.7600 6.6903 6.3849 3.8975 2.0766 6.1008 4.0384 1.5875 1.9444 6.2203 3.2962 1.5164 1.7129 1.8221 1.8429 6.0585 4.2025 6.0643 3.3638 1.1958 2.1167 1.5098 1.3147 1.4423 1.3260 1.3571 1.4655 1.3481 2.1756 4.9791 6.2765 3.3217 3.0942 6.1346 6.4281 7.8848 5.7780 1.0904 1.0914 1.0927 1.0916 1.0927 1.0640 1.0660 1.0662
irintensity: 0.7670 0.0352 0.0411 0.7808 3.0088 1.5566 1.2357 1.1639 2.1242 17.4780 17.1907 281.7204 19.3331 6.8833 16.1720 8.4586 38.1917 48.8294 3.4177 79.8134 82.7309 10.5221 3.4335 2.9547 27.4422 60.6519 0.0045 17.6943 50.5620 17.8278 37.5486 53.9101 570.2204 254.6229 128.4893 30.4293 43.5693 1.1926 95.1909 1.0676 76.9346 22.7275 8.2919 55.0780 68.0692 135.8289 114.0050 472.5514 85.5260 1.6204 6.7967 2.7605 9.6092 0.7833 54.0997 60.2782 30.1199
temp: 298.150 k
press: 1.00000 atm
elementType: 8 8 8 8 6 6 6 6 6 6 6 6 6 1 1 1 1 1 1 1 1
symmnumber: 1
zpe: 399677.4 jmol-1
zpe.correction: 0.152229 hartree
zpe.thermalcorrener: 0.164285 hartree
zpe.thermalcorrenthalpy: 0.165229 hartree
zpe.thermalcorrgfe: 0.113358 hartree
zpe.sumelectzpe: -647.704429 hartree
zpe.sumelectthermal: -647.692374 hartree
zpe.sumelectthermalent: -647.691430 hartree
zpe.sumelectthermalfe: -647.743300 hartree
dipole: 2.1042 2.6497 0.0032
dipole: 3.3836
quadrupole: -64.7662 -74.3893 -78.9266
quadrupole: -8.8510 0.0027 0.0135
quadrupole: 7.9278 -1.6953 -6.2325 -8.8510 0.0027 0.0135
hfenergy: -647.8566584 hartree
pointgroup: C01 [X(C9H8O4)]
dipole: 0.8189485 1.0494568 -0.0071861 debye
dipolederiv: -0.3039027 -0.4274468 -0.0008474 -0.6239172 -1.2503902 0.0068411 0.0001548 0.0060275 -0.430085 -0.7947254 0.6868616 0.0012546 0.802166 -0.8374756 -0.0054208 0.0008647 -0.004354 -0.4293106 -1.1314583 0.5713738 0.0043164 0.7058024 -0.7658788 -0.0049297 0.0042825 -0.0040165 -0.4397527 -0.9869017 -0.204189 0.0054139 -0.4318479 -0.9102542 0.0042926 0.0059888 0.0027528 -0.334849 -0.2376726 -0.0771769 0.0024804 -0.1211567 0.3362447 0.0003696 0.0024142 0.0000503 0.071725 -0.3635179 0.3636275 0.0003925 -0.1137109 -0.1390015 0.000735 0.0013039 -0.0029062 -0.2221428 -0.3198 -0.3700217 0.0014053 0.0575006 -0.3538962 -0.0003178 0.0005478 0.0030108 -0.2520645 0.3407659 0.4379944 -0.0022614 0.5851231 1.2877978 -0.0071239 -0.002922 -0.00622 0.1329981 0.9949986 -0.7047313 -0.0052115 -0.7449597 0.8560338 0.0042386 -0.0050588 0.0038493 0.1205247 -0.1278745 0.0793225 -0.0009925 0.060527 -0.5219884 0.000146 -0.0009989 -0.000114 -0.2393932 1.0064639 0.0147983 -0.0083008 -0.1588108 0.1314523 0.0007972 -0.0078316 -0.0006318 -0.074763 -1.4150155 0.00066 0.0094674 0.2238408 0.031626 -0.0020743 0.0089073 -0.0003652 -0.1888 2.5180532 -0.2205396 -0.0173176 0.138174 1.3160264 -0.0028978 -0.0182347 -0.0002137 0.2406268 0.0820495 -0.0612289 0.0008368 -0.0437419 -0.0077058 0.0006956 0.0008567 0.0008081 0.1786616 0.0404748 0.0878895 0.0007665 0.0533726 -0.0459617 0.0000898 0.0008653 -0.0000947 0.1755887 -0.0659273 -0.0032445 0.0019089 0.0094561 0.0941261 0.0001277 0.0018758 0.0001982 0.1911483 0.0795613 -0.0038767 0.0005459 -0.0479571 -0.0261965 0.0007395 0.000651 0.0004328 0.1504667 0.079435 -0.0514031 0.0008279 -0.0793657 -0.0504839 0.0010092 0.0009143 0.0007743 0.1738431 0.1102637 0.1423077 0.0024043 0.1336808 0.3636309 -0.0011083 0.0021622 -0.0015864 0.385662 0.2262887 -0.1506813 0.001645 -0.2221378 0.2643873 0.0020467 0.0018753 0.0014037 0.3900843 0.2684411 -0.1102953 0.0012654 -0.1820378 0.2279076 0.0017437 0.0013815 0.0011945 0.3998316 unknown
polarizability: 215.4483346|-6.3063375|125.0496587|-1.2968545|-0.1079558|45.1209898 unknown
InChI: InChI=1S/C9H8O4/c10-7-3-6(1-2-9(12)13)4-8(11)5-7/h1-5,10-12H
charge 0 multiplicity 1
21 atoms
O  2.653868 2.641608 -0.011968
O  3.365162 -2.158904 -0.006987
O  -4.559017 0.951027 0.047831
O  -4.053546 -1.323406 0.047985
C  0.213907 -0.213478 0.012837
C  1.132829 -1.294126 0.008103
C  0.703579 1.125539 0.006404
C  2.093433 1.35471 -0.00448
C  2.522764 -1.038471 -0.002896
C  3.017652 0.282618 -0.009217
C  -1.220142 -0.532067 0.024364
C  -2.263612 0.353126 0.03074
C  -3.654926 -0.13102 0.042481
H  0.783494 -2.330956 0.012769
H  0.006198 1.971298 0.009593
H  4.089965 0.507262 -0.017638
H  -1.482562 -1.599975 0.028707
H  -2.131852 1.439051 0.027857
H  1.949383 3.335986 -0.006159
H  4.317756 -1.892032 -0.015236
H  -5.486635 0.590811 0.055908
