program: Gaussian 09
title: 000193626
version: EM64L-G09RevD.01
frameworkgroup: C1[X(C13H20NO2)]
method: RPBEPBE
basis: SDD
operation: Freq
keyword: #p
keyword: freq=noraman
keyword: PBEPBE/SDD
title: #p freq=noraman PBEPBE/SDD
converged: YES YES NO NO
title: Mulliken charges:
elementType: O O N C C C C C C C C C C C C C H H H H H H H H H H H H H H H H H H H H
charge: -0.277589 -0.286836 -0.107607 -0.305965 -0.583944 -0.538796 -0.552255 -0.326758 0.181773 0.242787 -0.522321 0.445525 -0.347563 -0.327561 -0.200580 -0.793085 0.281061 0.256815 0.258513 0.257202 0.325655 0.268857 0.265657 0.266662 0.260385 0.307235 0.255421 0.268617 0.260422 0.274591 0.270558 0.252855 0.247743 0.248379 0.232048 0.242098
chargesum: 1.00000
title: Mulliken charges with hydrogens summed into heavy atoms:
elementType: O O N C C C C C C C C C C C C C
charge: -0.277589 -0.286836 -0.107607 0.231912 0.257426 0.262380 0.270786 0.202282 0.181773 0.242787 -0.247730 0.445525 -0.077005 -0.074707 0.047163 -0.070559
polarizability: 2.18686357e+02 4.38115878e+00 1.47486145e+02 -1.77416211e+01 8.30866761e+00 1.03012746e+02
1716.lowfreq: -5.8820 -0.0009 -0.0006 0.0003 5.4025 11.2996 33.8734 36.3791 54.1074
frequency: 33.8568 36.3472 54.0954 65.5616 95.3272 110.8790 137.4589 171.3349 201.3204 211.8033 228.2205 236.7376 271.9272 287.6506 329.4435 349.1533 355.9200 378.9550 408.0136 420.1894 432.1459 438.8371 472.0597 494.0689 521.0098 532.7455 651.7997 674.4418 681.1112 720.1855 738.3506 800.6572 818.9483 844.9186 874.9991 912.9714 921.9649 929.4824 957.1220 981.3297 988.7706 995.3829 1005.9239 1018.6627 1053.9802 1054.2438 1058.3571 1077.0096 1100.3607 1112.8195 1127.6436 1181.6194 1187.6201 1200.5315 1224.0188 1253.7624 1265.8732 1278.3683 1307.7262 1329.7334 1375.2991 1378.8771 1393.3162 1405.9928 1421.6152 1425.0794 1425.8921 1437.1011 1447.5540 1451.0671 1464.2222 1469.0277 1469.6441 1471.3406 1474.1728 1481.9742 1485.9321 1493.0233 1514.1119 1581.5209 1605.2855 1616.1005 2988.0111 3011.5389 3021.6194 3024.6313 3032.4362 3033.8197 3068.5536 3091.9202 3097.2588 3100.5532 3131.6627 3134.6328 3136.3773 3141.5881 3143.7347 3147.0255 3149.5902 3159.2437 3174.5422 3183.1581
redmass: 4.7437 3.5066 1.0293 3.0269 6.5671 2.4482 4.5602 3.1842 1.5773 2.9304 2.9011 2.6228 1.1101 1.2535 2.3274 2.1856 2.6164 4.1692 2.6643 3.0361 2.4647 2.2075 4.9794 3.5028 3.0947 3.6631 5.8397 3.6227 3.1146 2.9107 5.5213 3.9940 1.6062 2.9733 3.1479 1.3402 3.1314 2.8972 1.3950 1.9459 3.5712 2.1457 1.3643 2.0159 1.2452 1.5890 2.5009 2.0789 1.6245 1.3711 1.7366 1.9050 1.1506 1.3920 1.7329 1.8137 3.1588 1.3902 1.2926 1.2082 1.2512 1.3129 4.8189 1.3832 1.1436 2.1243 1.2454 1.0914 1.0876 1.0532 1.1322 1.0969 1.0482 1.8659 1.0640 1.2575 1.0822 1.0581 1.0540 6.0820 7.4366 6.4842 1.0378 1.0325 1.0542 1.0370 1.0561 1.0370 1.0975 1.1062 1.0993 1.1050 1.1065 1.0894 1.1052 1.1056 1.1054 1.1050 1.0922 1.0927 1.1045 1.0972
irintensity: 4.4642 0.5245 0.4416 1.6555 2.8606 2.5238 11.4127 2.6271 2.7279 1.7949 1.5500 3.8010 0.4612 3.5865 3.9090 1.7594 4.7782 7.9808 1.5163 1.4240 0.1573 0.3252 6.2569 5.4113 12.0472 2.6691 2.5597 2.5675 3.4276 47.8747 17.4718 27.7617 21.9347 23.7742 25.7407 1.9267 27.7175 77.4850 3.3368 42.9501 8.4077 25.5678 0.2135 29.2016 4.2667 16.4533 124.0059 76.2934 15.6174 7.6258 13.9160 154.7406 0.5240 0.8484 5.7197 0.5950 174.7047 6.5772 0.0360 7.5290 5.3143 5.6442 18.8030 18.7512 8.8308 18.6818 16.1814 8.4865 41.5379 3.0287 36.4192 28.7127 17.0519 22.1269 20.6020 14.9771 30.0639 26.5281 53.3196 66.7394 341.4613 18.8946 15.2091 26.3467 0.8729 4.6362 23.7777 20.1838 11.6315 1.0512 12.3364 4.1208 13.9101 4.7744 2.5330 0.4884 4.3719 7.3416 2.5090 8.9949 10.0947 4.1036
temp: 298.150 k
press: 1.00000 atm
elementType: 8 8 7 6 6 6 6 6 6 6 6 6 6 6 6 6 1 1 1 1 1 1 1 1 1 1 1 1 1 1 1 1 1 1 1 1
symmnumber: 1
zpe: 812657.9 jmol-1
zpe.correction: 0.309525 hartree
zpe.thermalcorrener: 0.326605 hartree
zpe.thermalcorrenthalpy: 0.327549 hartree
zpe.thermalcorrgfe: 0.264293 hartree
zpe.sumelectzpe: -711.113826 hartree
zpe.sumelectthermal: -711.096746 hartree
zpe.sumelectthermalent: -711.095802 hartree
zpe.sumelectthermalfe: -711.159058 hartree
dipole: 10.9980 0.1597 2.1465
dipole: 11.2066
quadrupole: -9.3313 -82.9543 -89.0676
quadrupole: -1.1313 1.7286 -2.3728
quadrupole: 51.1198 -22.5032 -28.6166 -1.1313 1.7286 -2.3728
hfenergy: -711.4233512 hartree
pointgroup: C01 [X(C13H20N1O2)]
dipole: 4.302436 0.2527962 0.9298247 debye
polarizability: 217.670442|13.2471492|144.6424609|-15.5854863|14.716474|106.8723458 unknown
InChI: InChI=1S/C13H20NO2/c1-11-6-5-7-12(10-11)13(15)16-9-8-14(2,3)4/h5-7,10H,8-9H2,1-4H3
charge 1 multiplicity 1
36 atoms
O  0.778546 1.436681 -0.314824
O  0.653652 -0.669389 -1.304721
N  3.729732 -0.030263 0.320898
C  3.278343 1.421866 0.006185
C  3.886058 -0.854098 -0.959889
C  5.084036 0.064282 1.02806
C  2.741153 -0.734171 1.254805
C  2.097037 1.631181 -0.948286
C  0.063941 0.263099 -0.690686
C  -1.343756 0.285872 -0.261343
C  -2.136758 -0.867339 -0.525267
C  -3.496959 -0.912747 -0.150183
C  -1.912491 1.415589 0.387117
C  -4.048615 0.226159 0.501848
C  -3.268598 1.374885 0.766028
C  -4.356044 -2.129209 -0.437165
H  3.065786 1.897523 0.979307
H  4.16213 1.915088 -0.437815
H  4.537456 -0.308603 -1.660544
H  4.349839 -1.817449 -0.696421
H  2.889992 -1.024439 -1.397222
H  4.980594 0.69519 1.924349
H  5.405512 -0.946761 1.320065
H  5.822537 0.505265 0.341096
H  2.576221 -0.107103 2.1437
H  1.80083 -0.904348 0.717185
H  3.174688 -1.701848 1.551515
H  2.114582 2.698668 -1.229157
H  2.168763 1.021575 -1.865035
H  -1.673882 -1.71942 -1.035243
H  -1.301971 2.301951 0.577705
H  -5.103626 0.210633 0.800763
H  -3.72233 2.237682 1.263892
H  -5.171919 -1.881328 -1.14118
H  -3.768325 -2.949474 -0.881433
H  -4.830653 -2.511398 0.484896
