program: Gaussian 09
title: 000193596
version: EM64L-G09RevD.01
frameworkgroup: C1[X(C22H26O2)]
method: RPBEPBE
basis: SDD
operation: Freq
keyword: #pfreq=noraman
keyword: PBEPBE/SDD
title: #p freq=noraman PBEPBE/SDD
converged: YES YES NO NO
title: Mulliken charges:
elementType: O O C C C C C C C C C C C C C C C C C C C C C C H H H H H H H H H H H H H H H H H H H H H H H H H H
charge: -0.440316 -0.233523 0.244444 -0.121480 0.266221 -0.239242 -0.546515 -0.507914 -0.318817 0.272140 -0.486828 -0.817835 -0.651495 -0.370982 0.092705 -0.604647 0.391593 -0.542613 0.088764 -0.526472 -0.525766 0.158502 -0.064267 -0.751316 0.284680 0.236115 0.218504 0.222250 0.229068 0.247512 0.234435 0.223928 0.223360 0.236796 0.228086 0.235991 0.252407 0.230730 0.210981 0.222672 0.237048 0.333164 0.233717 0.217394 0.255037 0.232701 0.244816 0.245742 0.252258 0.246269
chargesum: 0.00000
title: Mulliken charges with hydrogens summed into heavy atoms:
elementType: O O C C C C C C C C C C C C C C C C C C C C C C
charge: -0.107152 -0.233523 0.244444 0.163200 0.266221 -0.003127 -0.105761 -0.031334 -0.084382 0.272140 -0.039540 -0.116963 -0.168359 -0.160001 0.092705 -0.144927 0.391593 -0.091502 0.088764 -0.271435 -0.048248 0.158502 -0.064267 -0.007048
polarizability: 4.43139669e+02 -6.02280411e-01 2.02493167e+02 -1.66020977e+01 -2.44491349e+00 1.67180724e+02
1716.lowfreq: -4.2313 -0.0011 -0.0008 0.0000 4.0203 9.4827 20.3733 24.4690 33.2201
frequency: 19.9153 24.4305 33.1813 50.2020 58.3043 80.3406 112.5668 130.1753 143.6828 155.3247 187.7688 190.4160 196.9447 200.4118 225.1614 244.5187 260.5264 272.1381 276.1818 285.8628 302.8759 340.0322 349.1057 363.6852 375.3485 386.7669 392.6240 414.9842 422.4567 428.5390 443.6232 487.1717 512.0869 524.9215 545.4482 558.7219 584.9453 601.3578 638.2422 643.4400 675.0383 686.9249 718.1775 761.2469 773.3743 779.8664 783.0243 799.4143 835.3643 860.1791 868.3255 870.2216 882.5192 903.2751 930.7885 956.1181 966.2984 972.9360 983.4469 1006.0966 1011.5595 1019.9162 1022.4460 1029.9088 1032.7073 1035.6978 1048.4034 1065.0041 1094.1049 1110.7514 1110.9649 1131.6164 1150.1258 1155.6801 1167.6757 1173.2257 1176.8591 1184.2200 1195.2838 1197.7946 1210.7879 1222.7243 1239.3836 1240.7219 1254.8278 1267.6380 1276.1843 1279.8037 1289.0397 1298.7732 1310.0676 1317.5760 1322.9444 1327.9004 1334.2597 1348.4428 1353.6486 1378.2716 1384.0711 1392.1266 1401.6366 1403.2141 1445.0560 1449.3000 1454.5350 1457.3968 1457.7974 1463.1034 1463.7086 1468.0652 1470.0733 1484.5343 1491.6214 1546.4093 1571.1742 1580.8703 1601.3239 2291.5687 2916.7521 2944.9925 2956.9993 2961.9171 2973.6726 2978.4589 2980.9633 2981.7373 2984.8538 2992.6479 3016.4764 3025.6891 3045.1978 3049.3565 3059.3578 3061.1230 3061.8356 3063.8913 3070.8118 3072.8195 3078.9142 3081.3097 3094.0876 3127.4501 3139.9921 3535.4901
redmass: 4.5204 1.0535 4.3237 4.2950 3.4623 4.0303 3.2742 3.6978 2.9575 3.2999 2.9624 4.4425 2.7049 2.3598 2.3883 2.2388 1.7052 2.9934 1.4616 2.0259 2.4798 2.7723 4.2185 4.1317 3.2417 2.8352 4.8894 3.4774 3.6574 3.5357 4.0792 3.8252 3.8790 2.9182 3.2836 3.5223 3.5974 2.7095 3.6078 3.1820 4.2636 3.2749 2.8205 4.3867 2.0891 2.2592 2.7155 1.7632 2.3618 2.0325 2.4236 2.2720 1.5923 2.1404 1.8527 1.6834 1.4052 2.6619 2.4414 2.5337 2.1625 2.2217 2.0638 1.5006 1.4224 1.9573 2.3972 2.4440 2.6283 2.7542 1.9311 1.8365 1.5993 1.2741 1.8351 2.7266 1.6009 2.2752 1.4877 1.6694 1.4205 1.8063 1.3924 1.4781 1.4230 1.4410 1.5686 1.7927 1.4381 1.3694 1.8374 1.6356 1.4519 1.6029 1.5932 1.5416 1.5048 1.3783 1.2770 3.6793 1.2346 1.6686 1.0861 1.0833 1.0917 1.0917 1.0753 1.0417 1.0418 1.0948 1.0620 1.0720 1.0748 8.7401 8.0766 7.5394 7.4416 11.6399 1.0795 1.0643 1.0666 1.0693 1.0350 1.0696 1.0641 1.0433 1.0619 1.0679 1.0916 1.0640 1.0937 1.1027 1.0990 1.0985 1.0985 1.0910 1.0963 1.0989 1.0877 1.0987 1.1021 1.0911 1.0920 1.0654
irintensity: 1.0326 0.0648 0.7032 2.7259 0.4666 0.1614 1.0687 3.8950 3.1900 1.1346 3.5052 0.6048 2.8805 15.7214 2.5774 38.6975 16.9588 3.3110 165.0934 30.7542 53.1022 13.1995 22.6495 0.0462 10.2624 10.1813 7.1209 3.2310 0.1997 2.8284 4.0560 4.1758 2.4226 3.6465 5.9643 1.5445 2.1606 0.4665 1.4817 1.5948 29.8059 2.2894 11.9652 1.4392 14.2369 4.0052 14.9108 3.1329 2.6116 1.6968 7.2130 9.5944 15.8439 12.6760 4.3689 29.0003 5.3599 8.2391 0.2358 59.7100 11.4115 13.8406 4.5041 4.9508 2.7859 7.5663 9.3019 22.5061 0.5530 19.8278 0.5714 2.8373 5.8927 2.4123 1.5095 2.7571 13.9418 4.3585 28.2559 31.3061 10.3046 33.4473 21.5904 9.7724 12.7891 18.4123 25.2953 34.5967 8.9109 8.9548 13.2118 9.0814 0.0861 6.6800 4.7266 7.1233 3.2279 16.1071 13.7179 17.8638 0.5980 3.1107 12.6565 6.6638 12.5704 6.5063 9.3965 12.8860 11.1159 8.1872 9.5573 2.7856 10.2596 48.2690 39.3820 402.2080 88.5278 1.0805 13.5666 38.2170 19.9776 18.9424 52.0377 17.9599 20.2476 20.7058 28.3390 30.7090 11.7819 40.7727 35.5834 33.2261 23.1808 15.8715 15.8184 21.0403 22.0437 15.6259 12.9343 54.9074 18.2630 7.1131 26.4829 3.0040
temp: 298.150 k
press: 1.00000 atm
elementType: 8 8 6 6 6 6 6 6 6 6 6 6 6 6 6 6 6 6 6 6 6 6 6 6 1 1 1 1 1 1 1 1 1 1 1 1 1 1 1 1 1 1 1 1 1 1 1 1 1 1
symmnumber: 1
zpe: 1102947.3 jmol-1
zpe.correction: 0.420090 hartree
zpe.thermalcorrener: 0.443250 hartree
zpe.thermalcorrenthalpy: 0.444194 hartree
zpe.thermalcorrgfe: 0.367147 hartree
zpe.sumelectzpe: -1002.536345 hartree
zpe.sumelectthermal: -1002.513186 hartree
zpe.sumelectthermalent: -1002.512242 hartree
zpe.sumelectthermalfe: -1002.589288 hartree
dipole: -5.9305 0.4087 2.2858
dipole: 6.3689
quadrupole: -186.3326 -130.7723 -143.7929
quadrupole: 5.4394 5.8529 -1.1756
quadrupole: -32.7000 22.8603 9.8397 5.4394 5.8529 -1.1756
hfenergy: -1002.9564355 hartree
pointgroup: C01 [X(C22H26O2)]
dipole: 2.3467758 -0.1882652 0.8578051 debye
polarizability: 443.5952909|-1.8344536|202.389637|12.1063594|3.1293041|166.8286315 unknown
InChI: InChI=1S/C22H26O2/c1-3-4-11-22(24)13-10-20-19-7-5-15-14-16(23)6-8-17(15)18(19)9-12-21(20,22)2/h9,12,14,19-20,24H,5-8,10-11,13H2,1-2H3
charge 0 multiplicity 1
50 atoms
O  2.737812 0.812246 -1.289621
O  -6.903102 0.71118 -0.637883
C  1.563297 0.034475 0.774203
C  0.727664 -0.909491 -0.145426
C  2.920569 0.050095 -0.030069
C  -0.703605 -1.115955 0.380741
C  1.673396 -2.108277 -0.383344
C  3.087663 -1.434388 -0.483316
C  0.825463 1.347224 0.912272
C  -1.398249 0.260088 0.473628
C  -1.528491 -2.112997 -0.45715
C  1.787249 -0.544281 2.207058
C  4.132278 0.632966 0.750301
C  -0.541009 1.412184 0.784258
C  -2.773138 0.394205 0.27829
C  -2.974597 -2.160015 0.076245
C  -3.615909 -0.782198 0.019974
C  -3.513546 1.726477 0.412373
C  5.392607 0.623858 -0.012721
C  -4.970018 -0.661995 -0.245893
C  -4.731076 1.846329 -0.534243
C  -5.646774 0.624388 -0.456992
C  6.455605 0.613214 -0.639026
C  7.714921 0.60879 -1.400732
H  0.646059 -0.376526 -1.115395
H  -0.649353 -1.532631 1.412383
H  1.42157 -2.666184 -1.301593
H  1.632816 -2.826288 0.458643
H  3.838902 -1.952987 0.13759
H  3.467002 -1.426538 -1.51822
H  1.38239 2.251973 1.200115
H  -1.069319 -3.117832 -0.404772
H  -1.526952 -1.8016 -1.520634
H  2.378065 -1.478011 2.189998
H  2.316361 0.184653 2.846803
H  0.822579 -0.757449 2.698478
H  4.272623 0.058808 1.685704
H  3.895014 1.674717 1.058083
H  -1.023369 2.383307 0.940907
H  -2.951059 -2.509203 1.130746
H  -3.589509 -2.885229 -0.486025
H  2.539911 1.758677 -1.065242
H  -3.874133 1.818107 1.458926
H  -2.842577 2.582638 0.233632
H  -5.591612 -1.558645 -0.362311
H  -4.382021 1.931833 -1.583977
H  -5.322089 2.751844 -0.312577
H  8.334084 -0.272704 -1.151276
H  7.519184 0.585518 -2.488724
H  8.315021 1.512625 -1.186882
