program: Gaussian 09
title: 000193577
version: EM64L-G09RevD.01
frameworkgroup: C1[X(C4H9NO4)]
method: RPBEPBE
basis: SDD
operation: Freq
keyword: #pfreq=noraman
keyword: PBEPBE/SDD
title: #p freq=noraman PBEPBE/SDD
converged: YES YES NO NO
title: Mulliken charges:
elementType: O O O O N C C C C H H H H H H H H H
charge: -0.445914 -0.444375 -0.474516 -0.203256 -0.576842 -0.121942 -0.201588 -0.371107 0.162965 0.253470 0.275795 0.228555 0.223181 0.303656 0.282321 0.370724 0.348424 0.390451
chargesum: 0.00000
title: Mulliken charges with hydrogens summed into heavy atoms:
elementType: O O O O N C C C C
charge: -0.075191 -0.095951 -0.084065 -0.203256 0.009134 0.131528 0.074207 0.080628 0.162965
polarizability: 6.59098468e+01 1.31727329e-01 6.99620984e+01 6.00025569e+00 -2.69585391e+00 5.39862516e+01
1716.lowfreq: -14.2492 -0.0005 0.0011 0.0013 13.5451 19.1033 49.5193 67.8070 153.1476
frequency: 49.3935 67.7567 153.1403 196.2378 227.4493 238.2381 275.4578 309.3514 343.5699 412.1711 447.5584 464.8379 508.6446 532.0500 582.5351 616.5508 665.0663 729.0206 791.4479 874.0723 948.4565 979.2517 1009.0199 1024.4880 1065.0004 1127.4146 1163.0043 1202.9315 1214.1323 1251.7411 1294.1653 1315.9521 1342.2420 1357.0013 1374.7320 1394.2003 1471.9323 1635.0371 1676.6140 2992.3522 2997.5978 3051.3505 3082.0279 3437.5631 3459.2285 3499.4864 3565.2070 3573.3218
redmass: 10.4056 5.1285 2.3663 4.5103 2.7322 1.5556 4.4271 3.6655 5.6376 1.6468 2.2529 2.6616 4.1431 1.1299 3.5520 1.3951 3.2486 1.4197 3.5013 2.5281 3.7836 3.8216 3.0405 2.0942 2.2797 1.1696 2.1950 1.4887 1.8080 1.3805 1.3805 1.3177 1.2509 1.3992 1.2658 1.1742 1.0811 1.0863 9.2168 1.0800 1.0647 1.0879 1.1017 1.0468 1.0655 1.0642 1.0662 1.0965
irintensity: 3.4701 0.9325 18.1806 2.3748 71.5872 89.7587 12.1124 53.1243 12.8018 38.2939 19.3010 82.3887 15.0884 95.6474 30.5790 165.4328 14.2291 216.3141 17.8978 16.4357 98.6532 26.7706 182.4683 62.7009 40.7280 51.2491 7.4753 12.3058 12.4019 1.0171 10.7866 3.2763 7.6163 3.2634 1.1431 75.6340 6.6777 50.5409 229.2417 16.8526 38.0500 9.5519 40.5214 18.9375 75.2577 10.0797 8.4967 17.0902
temp: 298.150 k
press: 1.00000 atm
elementType: 8 8 8 8 7 6 6 6 6 1 1 1 1 1 1 1 1 1
symmnumber: 1
zpe: 370782.5 jmol-1
zpe.correction: 0.141224 hartree
zpe.thermalcorrener: 0.151408 hartree
zpe.thermalcorrenthalpy: 0.152352 hartree
zpe.thermalcorrgfe: 0.105835 hartree
zpe.sumelectzpe: -512.714773 hartree
zpe.sumelectthermal: -512.704589 hartree
zpe.sumelectthermalent: -512.703645 hartree
zpe.sumelectthermalfe: -512.750161 hartree
dipole: -0.4748 0.6383 -0.3103
dipole: 0.8539
quadrupole: -47.5042 -58.3281 -55.8777
quadrupole: -7.0061 0.3189 -8.1582
quadrupole: 6.3991 -4.4247 -1.9744 -7.0061 0.3189 -8.1582
hfenergy: -512.8559965 hartree
pointgroup: C01 [X(C4H9N1O4)]
dipole: -0.1654637 -0.2617616 0.1302285 debye
dipolederiv: -0.563301 -0.0538458 -0.1721655 -0.0133439 -0.8056164 -0.0352012 -0.197333 -0.0305588 -0.4322077 -0.5597515 -0.1500917 -0.2847124 -0.1306512 -0.7220289 -0.0125724 -0.3395601 -0.0166088 -0.3644961 -0.4805122 -0.1808135 0.0069937 -0.0684117 -1.1866146 0.1493943 -0.0202366 0.2752663 -0.4070409 -0.5669907 0.2552269 0.2062815 0.1429639 -0.7760703 -0.0441601 0.3158758 -0.2307985 -0.5155172 -0.4647541 -0.0749467 0.2202458 -0.1101238 -0.6032225 0.1338415 0.1687226 0.154433 -0.5597147 0.4433111 0.0383331 0.0618483 -0.0524528 0.5223789 0.0866932 0.0695032 -0.0114118 0.2433811 0.0649118 0.1865511 -0.0490825 0.2272485 0.4001766 -0.2114818 0.0000379 -0.0696634 0.1426926 0.3278592 0.1449821 0.0174014 0.1455507 0.5165162 0.0078196 0.038608 -0.018635 0.2123064 0.5836159 -0.1596898 -0.3584644 -0.1320356 1.4345864 -0.0304742 -0.4864811 0.0645472 0.5968684 -0.0478357 -0.0443222 0.084645 -0.033921 0.0322407 0.0181113 0.0722562 0.0399382 -0.0491117 -0.000462 -0.0611822 -0.0505156 -0.0662087 0.0388423 -0.01664 -0.0576802 -0.0333798 -0.0180867 -0.107622 0.1060757 -0.0390499 0.0938158 -0.081448 0.0138003 -0.0266902 -0.0152284 0.0727748 0.0152273 -0.0671008 0.1114938 -0.0348087 0.0339662 0.0067833 0.0853648 0.0259974 -0.0487001 0.3646047 -0.0118065 -0.0076994 -0.0425219 0.1829293 -0.0252004 -0.0440025 -0.0856103 0.1686525 0.0647211 0.1143234 -0.1069555 0.0572285 0.1210193 -0.0040866 -0.0401676 -0.0940637 0.3413568 0.3824428 -0.0604649 0.0466037 -0.0650417 0.3529722 0.0207268 0.0671568 0.0238505 0.2457715 0.2959535 0.0023561 0.1643219 0.0135041 0.2586416 -0.0209909 0.2220845 0.012431 0.1544472 0.2485816 0.0164159 0.1488101 0.0692096 0.2807312 -0.0363627 0.1725415 0.0094949 0.2166239 unknown
polarizability: 64.3857906|-0.2204894|70.1819457|-7.1713395|-2.1060119|55.2904606 unknown
InChI: InChI=1S/C4H9NO4/c5-3(4(8)9)2(7)1-6/h2-3,6-8H,1,5H2
charge 0 multiplicity 1
18 atoms
O  0.512347 -1.906302 -0.988873
O  2.002881 1.151653 0.669281
O  -1.641535 -1.187463 0.538127
O  -2.132876 1.065051 0.813102
N  -0.166753 1.797042 -1.194218
C  0.786408 -0.47694 -0.829421
C  -0.507645 0.393742 -0.969652
C  1.570047 -0.249245 0.486574
C  -1.493203 0.187015 0.207347
H  1.417803 -0.205766 -1.693496
H  -1.024815 -0.004859 -1.8664
H  2.433496 -0.943068 0.499801
H  0.938121 -0.462044 1.366057
H  0.375646 2.191451 -0.415721
H  -0.965158 2.381995 -1.458104
H  -0.230859 -2.14068 -0.367346
H  2.694116 1.362781 -0.008213
H  -2.302821 -1.291363 1.275356
