program: Gaussian 09
title: 000193575
version: EM64L-G09RevD.01
frameworkgroup: C1[X(C18H26N4)]
method: RPBEPBE
basis: SDD
operation: Freq
keyword: #p
keyword: freq=noraman
keyword: PBEPBE/SDD
title: #p freq=noraman PBEPBE/SDD
converged: YES YES NO NO
title: Mulliken charges:
elementType: N N N N C C C C C C C C C C C C C C C C C C H H H H H H H H H H H H H H H H H H H H H H H H H H
charge: -0.238573 -0.238514 -0.090999 -0.091007 0.535414 0.535341 -0.592555 -0.552603 -0.551841 -0.552142 -0.592479 -0.552475 -0.308417 -0.308459 -0.316847 -0.316888 -0.366243 -0.366264 -0.294069 -0.294060 0.187048 0.187068 0.277608 0.275264 0.278666 0.273621 0.270254 0.281848 0.282486 0.270103 0.272219 0.282193 0.270142 0.272726 0.278347 0.277834 0.275335 0.270259 0.282125 0.273212 0.255206 0.255245 0.271927 0.271992 0.281975 0.281972 0.298497 0.298505
chargesum: 2.00000
title: Mulliken charges with hydrogens summed into heavy atoms:
elementType: N N N N C C C C C C C C C C C C C C C C C C
charge: -0.238573 -0.238514 -0.090999 -0.091007 0.535414 0.535341 0.238983 0.273121 0.272967 0.272919 0.239037 0.273121 -0.053211 -0.053214 -0.044920 -0.044896 -0.084268 -0.084291 0.004429 0.004445 0.187048 0.187068
polarizability: 4.61985095e+02 -9.59550467e+00 1.95948731e+02 2.39695334e-02 2.24319433e-03 1.23852765e+02
1716.lowfreq: -11.1445 -2.2097 -0.0010 0.0007 0.0012 4.8215 12.3375 25.7438 45.2554
frequency: 12.2522 25.7430 45.2552 49.8855 60.2877 67.9126 125.7351 136.0163 140.1195 172.7609 173.6397 174.8310 233.0428 248.2626 251.8629 259.4915 293.2534 301.2142 308.3838 338.5959 339.0979 343.2757 347.6157 374.0907 386.8148 411.5863 413.6377 414.8230 432.4315 454.5912 465.7463 472.5953 518.2779 524.5192 547.8405 570.4273 579.4493 622.3252 632.3918 651.3055 713.8707 729.2173 746.7015 805.6583 812.9562 827.7820 831.6569 832.8506 849.5246 861.2877 901.6233 911.9286 912.7840 929.1588 929.5410 979.3033 981.6414 994.7980 994.9258 996.4727 996.8003 1044.5811 1044.8625 1094.9228 1095.8889 1102.6282 1102.7278 1103.2897 1103.9891 1128.0568 1138.5087 1143.8348 1171.1356 1206.6651 1211.8792 1211.9299 1217.7286 1217.8756 1234.4482 1252.2429 1255.3333 1305.9008 1309.6159 1368.9825 1384.4885 1390.9289 1409.3763 1417.8531 1419.5956 1421.1454 1421.8895 1421.9547 1452.2356 1452.3960 1455.9854 1456.2423 1460.7740 1460.8171 1464.3728 1465.0966 1479.2221 1479.8241 1482.4494 1486.4903 1490.2528 1490.3500 1500.6168 1500.8893 1584.5921 1586.3843 1603.7065 1605.3977 3032.2080 3032.3988 3032.5068 3032.5864 3036.0180 3036.0515 3146.4755 3146.6166 3147.5959 3147.8058 3153.1761 3153.3434 3153.7914 3153.8477 3156.9870 3157.3448 3163.7981 3163.8261 3167.4909 3167.6302 3171.3318 3171.5082 3179.1850 3179.2701 3189.2630 3189.3563
redmass: 3.0225 4.6031 4.6745 3.7890 3.2012 3.6499 3.1833 4.7894 3.1635 1.5093 2.5371 1.2317 2.2066 1.0797 1.2186 3.7583 3.4330 3.1629 3.5005 1.0812 1.0782 3.0673 3.0517 2.8791 2.6856 2.7259 2.8061 3.3844 3.2384 3.2957 3.1310 4.2242 3.3242 5.4912 2.7206 3.3749 2.5198 7.1347 7.0878 5.0382 6.0820 3.9266 3.8245 3.6017 3.3393 5.6823 1.2494 1.2580 1.5574 1.7031 7.6951 2.7380 2.6922 2.7678 2.7711 1.3723 1.3931 1.3821 1.3959 3.0511 3.0603 1.1907 1.1908 1.3764 1.3415 1.3117 1.3029 3.0613 2.8118 1.8651 1.2786 1.6144 1.4354 1.3313 1.8278 1.8287 1.8075 1.8056 2.2385 1.9525 2.1413 1.3100 1.3306 7.0890 8.0629 10.2797 2.8623 1.5498 1.1778 1.7972 1.1397 1.1564 1.0510 1.0493 1.1607 1.1545 1.0429 1.0433 1.1508 1.1138 1.1939 1.0794 1.5193 1.9519 1.0447 1.0457 1.0572 1.0567 7.0669 7.1128 6.6172 6.4496 1.0319 1.0319 1.0318 1.0319 1.0331 1.0331 1.1055 1.1054 1.1059 1.1059 1.0962 1.0983 1.0978 1.1014 1.1059 1.1059 1.1056 1.1057 1.1036 1.1037 1.0892 1.0891 1.0965 1.0966 1.0960 1.0960
irintensity: 0.0003 8.9075 6.6186 0.4788 0.0006 0.0011 0.0370 0.0006 0.0315 0.1488 0.0568 0.1475 1.7449 0.0608 0.2128 0.0471 0.2538 0.0039 0.0678 0.2167 0.0313 0.0020 3.0834 0.0108 3.5285 0.1387 0.0152 0.0084 0.0038 4.4813 0.0244 4.7863 1.7276 15.7397 0.0515 0.0780 75.3352 0.0005 6.5002 6.6623 0.0060 0.0287 0.8536 59.4161 0.0022 33.6817 0.8748 0.0345 0.0591 67.6402 0.0041 0.3772 72.8947 22.4726 10.7780 0.0150 3.2441 1.6955 1.1437 46.1511 0.1289 0.0704 0.0718 0.0251 5.5537 0.3404 0.3559 0.0065 20.2679 0.0067 19.0042 0.0031 27.0887 0.0004 0.0945 0.1211 0.7174 0.4490 36.0547 0.0007 9.4045 2.2794 0.0002 0.0046 11.7608 0.0066 17.0065 0.2016 53.9610 2.2799 7.6068 28.3899 0.3578 0.2523 0.1770 7.3153 1.2806 3.4113 0.1245 5.5318 0.9602 91.8869 0.1163 111.2077 32.7670 40.6249 172.6870 10.3065 6.7054 0.0027 0.0007 10.2036 1.8729 2.1155 1.4670 1.7649 2.2518 1.7398 0.1257 0.1510 0.3030 0.2212 41.5442 4.9749 0.3080 2.3528 1.1031 1.0162 0.8126 0.8077 3.5877 3.0457 1.4062 0.0001 2.0442 0.1525 13.4244 0.0585
temp: 298.150 k
press: 1.00000 atm
elementType: 7 7 7 7 6 6 6 6 6 6 6 6 6 6 6 6 6 6 6 6 6 6 1 1 1 1 1 1 1 1 1 1 1 1 1 1 1 1 1 1 1 1 1 1 1 1 1 1
symmnumber: 1
zpe: 1084029.8 jmol-1
zpe.correction: 0.412885 hartree
zpe.thermalcorrener: 0.435175 hartree
zpe.thermalcorrenthalpy: 0.436120 hartree
zpe.thermalcorrgfe: 0.360592 hartree
zpe.sumelectzpe: -918.265504 hartree
zpe.sumelectthermal: -918.243213 hartree
zpe.sumelectthermalent: -918.242269 hartree
zpe.sumelectthermalfe: -918.317797 hartree
dipole: 0.0004 -0.0027 -0.0494
dipole: 0.0495
quadrupole: 251.4538 -101.0723 -121.4608
quadrupole: 3.4988 -0.0029 0.0072
quadrupole: 241.8136 -110.7125 -131.1011 3.4988 -0.0029 0.0072
hfenergy: -918.6783888 hartree
pointgroup: C01 [X(C18H26N4)]
dipole: 0.0000758 0.0193621 0.0021281 debye
polarizability: 462.1390349|2.8157373|125.7698656|-6.6169755|-11.5598026|193.8776894 unknown
InChI: InChI=1S/C18H26N4/c1-21(2,3)17-11-7-15(8-12-17)19-20-16-9-13-18(14-10-16)22(4,5)6/h7-14H,1-6H3
charge 2 multiplicity 1
48 atoms
N  -6.107901 -0.0058 -0.140766
N  6.124474 0.011657 0.143568
N  -0.367308 -0.100364 0.52586
N  0.383863 0.075602 -0.526345
C  -4.581609 -0.01881 -0.026127
C  4.59816 0.018715 0.028845
C  -6.594253 0.281625 -1.563944
C  -6.667573 -1.378458 0.274492
C  -6.6862 1.086925 0.776953
C  6.688225 1.348861 -0.370368
C  6.610602 -0.171876 1.583944
C  6.698461 -1.146893 -0.692523
C  -4.012796 -0.256813 1.246769
C  4.02929 0.194989 -1.254013
C  -3.762768 0.199027 -1.158152
C  3.779285 -0.147003 1.16971
C  -2.612335 -0.274998 1.383902
C  2.628846 0.207255 -1.391801
C  -2.362412 0.177988 -1.016102
C  2.378944 -0.135869 1.026336
C  -1.778775 -0.059374 0.256806
C  1.79531 0.041952 -0.256229
H  -6.229615 -0.500092 -2.245659
H  -7.694389 0.271257 -1.55365
H  -6.242047 1.273094 -1.8833
H  -6.381504 -1.593847 1.312748
H  -7.764672 -1.351336 0.188028
H  -6.248821 -2.145551 -0.393317
H  -6.267023 2.057835 0.474753
H  -7.781846 1.091232 0.669844
H  -6.416404 0.873806 1.819951
H  6.269818 2.16412 0.237944
H  7.784934 1.325266 -0.279159
H  6.406224 1.488709 -1.422516
H  6.241225 0.654854 2.207515
H  6.262641 -1.1398 1.972412
H  7.710735 -0.157932 1.574094
H  7.794457 -1.146008 -0.588357
H  6.278179 -2.09197 -0.318272
H  6.425252 -1.010905 -1.747488
H  -4.627175 -0.427453 2.136149
H  4.643633 0.323996 -2.150352
H  -4.180629 0.385926 -2.149492
H  4.196748 -0.284479 2.169266
H  -2.147884 -0.455295 2.357666
H  2.164421 0.343746 -2.372676
H  -1.712045 0.344274 -1.879488
H  1.728559 -0.262286 1.89644
