program: Gaussian 09
title: 000193562
version: EM64L-G09RevD.01
frameworkgroup: C1[X(C7H14N2O3S)]
method: RPBEPBE
basis: SDD
operation: Freq
keyword: #p
keyword: freq=noraman
keyword: PBEPBE/SDD
title: #p freq=noraman PBEPBE/SDD
converged: YES YES NO NO
title: Mulliken charges:
elementType: S O O O N N C C C C C C C H H H H H H H H H H H H H H
charge: 0.141601 -0.403588 -0.285546 -0.286872 -0.391487 -0.564453 -0.159292 -0.675397 -0.645354 -0.327578 0.234853 0.232502 -0.778458 0.267980 0.295823 0.263286 0.275857 0.259401 0.255264 0.228194 0.377749 0.297625 0.284804 0.241772 0.230505 0.250085 0.380723
chargesum: 0.00000
title: Mulliken charges with hydrogens summed into heavy atoms:
elementType: S O O O N N C C C C C C C
charge: 0.141601 -0.022865 -0.285546 -0.286872 -0.013737 0.017976 0.108688 -0.116288 -0.110095 0.155880 0.234853 0.232502 -0.056096
polarizability: 1.42579661e+02 4.19041765e+00 1.13968905e+02 5.45423749e-01 -7.84921548e+00 1.00512715e+02
1716.lowfreq: -10.7988 -0.0015 0.0011 0.0012 1.1770 6.5610 24.1269 38.8037 58.0416
frequency: 24.0669 38.7334 57.9907 69.5693 82.5281 94.4615 106.5565 137.3248 152.9300 212.4792 227.1941 250.8592 259.9652 296.8629 312.6220 351.4248 406.7707 465.9437 468.9645 532.0634 573.7845 580.1429 597.1381 623.1145 625.5873 687.2826 721.4532 762.3522 786.3796 792.0636 892.4206 929.0768 963.4752 994.9146 997.7370 1026.7251 1043.9486 1059.0090 1103.5189 1109.5095 1118.9247 1182.1347 1202.5818 1240.1863 1247.2780 1268.0102 1281.2414 1303.6239 1353.3144 1363.3310 1364.4893 1384.2935 1428.9280 1437.7216 1446.0170 1456.9007 1468.4825 1522.7826 1620.8149 1630.6758 1636.2892 2994.6257 2996.7971 3026.7870 3037.0303 3059.4258 3060.7645 3092.6554 3102.3011 3104.2414 3119.9567 3412.6337 3480.9404 3500.6201 3618.0644
redmass: 5.1932 4.7942 5.0330 5.1284 2.9417 2.9843 1.6328 6.4246 3.1261 5.5050 3.7118 4.5033 2.7924 1.2433 2.1751 3.6651 2.8971 2.6483 3.4211 1.3283 3.1843 3.7391 3.2096 1.5835 4.1382 3.5628 4.0658 2.2589 1.3279 2.0780 2.5637 1.5797 2.1668 2.7447 1.8502 1.8342 1.6403 2.2173 2.9484 1.3670 2.6810 1.2262 1.4830 1.2446 1.4424 1.3636 2.3491 1.1458 1.6486 1.3930 1.3146 1.2362 1.0876 1.1028 1.0928 1.0492 1.1002 1.7432 4.8555 2.2044 1.6880 1.0353 1.0586 1.0597 1.0586 1.0850 1.1028 1.0977 1.1017 1.1063 1.1075 1.0821 1.0446 1.0639 1.1003
irintensity: 2.4848 0.6840 4.3559 4.8318 3.8972 1.4817 0.9617 1.8962 2.4974 4.1012 0.4560 4.1833 3.6835 51.8072 10.2891 15.4092 7.5919 1.3418 37.4158 294.6218 8.5229 4.4427 15.9200 95.7121 13.1451 28.0186 33.2157 33.1420 107.7865 18.2027 6.3411 9.5904 6.8275 53.3067 16.9099 9.5161 12.3233 280.9150 17.1218 7.9085 4.6305 11.3721 10.1145 14.5544 5.7187 17.1089 104.2242 19.6861 13.3098 9.2601 10.9580 60.8203 14.8065 31.5174 7.7626 15.3210 20.6982 212.1287 303.2316 118.7444 87.8044 8.4480 31.1223 18.3558 9.9264 8.2999 7.1305 11.2671 19.4675 13.7805 5.0489 323.1980 6.9607 26.1296 9.1554
temp: 298.150 k
press: 1.00000 atm
elementType: 16 8 8 8 7 7 6 6 6 6 6 6 6 1 1 1 1 1 1 1 1 1 1 1 1 1 1
symmnumber: 1
zpe: 568129.3 jmol-1
zpe.correction: 0.216389 hartree
zpe.thermalcorrener: 0.232173 hartree
zpe.thermalcorrenthalpy: 0.233118 hartree
zpe.thermalcorrgfe: 0.171496 hartree
zpe.sumelectzpe: -1007.356839 hartree
zpe.sumelectthermal: -1007.341055 hartree
zpe.sumelectthermalent: -1007.340111 hartree
zpe.sumelectthermalfe: -1007.401732 hartree
dipole: -4.9951 -2.0291 -0.9061
dipole: 5.4671
quadrupole: -99.6457 -80.1077 -82.0265
quadrupole: 10.0835 -2.1860 -0.7269
quadrupole: -12.3857 7.1523 5.2335 10.0835 -2.1860 -0.7269
hfenergy: -1007.5732282 hartree
pointgroup: C01 [X(C7H14N2O3S1)]
dipole: 1.8886454 0.8900634 -0.5169498 debye
dipolederiv: -0.355102 -0.0303161 -0.0887755 -0.1188229 -0.2134986 0.0713448 -0.0781757 0.1037929 -0.082222 -0.818787 -0.2002772 0.4963918 -0.2457436 -0.379142 0.1433121 0.5792625 0.109991 -0.864205 -1.2086406 0.1076542 0.1750559 0.2987083 -0.6130832 0.1709101 0.0443685 0.1551641 -0.4683164 -1.0032018 -0.0110028 0.3286593 -0.2509326 -0.58528 0.0654184 0.3297035 -0.1090557 -0.5815208 -0.8970939 0.2091682 0.23302 0.3385132 -0.7222137 -0.2143052 0.3565867 -0.2182157 -0.7518222 -0.4761238 -0.1108604 -0.2885422 -0.0507608 -0.5941778 0.1768495 -0.358143 0.1601422 -0.7141829 0.2845559 0.1704582 0.1326361 0.0957508 0.3960443 0.0606828 0.0255786 -0.0145666 0.2205159 0.0717201 0.0434129 0.106825 0.0602546 0.1055488 0.0681087 0.1935767 0.0559688 0.111539 0.5046879 0.0031064 -0.0261399 0.0270275 0.0039021 -0.0654538 0.0100247 -0.0272042 0.008368 -0.0643489 0.0812344 0.1461729 -0.165872 0.4394397 0.1383101 0.076076 0.0539446 0.259368 1.4770261 -0.082245 -0.5337483 -0.2057512 0.6346785 -0.4029107 -0.46514 -0.4152018 0.9601099 1.2429825 -0.0869463 -0.6785551 -0.0039245 0.891899 0.3084258 -0.8158726 0.4606688 0.8200453 0.0254762 -0.0597667 -0.0151157 -0.0319855 -0.3670412 -0.1571885 -0.019312 -0.149273 -0.021557 -0.005885 0.0520138 0.0257649 0.0636496 0.0360128 -0.0380143 0.0385206 -0.0419041 0.0251057 0.0325406 0.0045173 -0.0679412 -0.0154056 0.0046018 0.0214571 -0.0788216 0.0415894 -0.0576836 0.0128039 -0.0021953 0.0324256 0.02111 -0.0179379 -0.0947204 0.0352185 -0.0719892 0.0191961 -0.04695 -0.0000831 0.0115637 0.0214731 0.0954932 -0.0071132 0.018443 0.0479539 -0.0854987 -0.0374498 -0.0567587 -0.014449 -0.0198858 -0.0983992 -0.071632 -0.0230782 -0.0770034 0.0795596 -0.0574289 -0.0744199 -0.0418122 0.0553731 0.0627079 0.002369 0.0114362 0.0516429 0.1374243 0.1416666 0.0114041 0.0514272 0.0407327 -0.0098117 -0.0148494 0.0014976 -0.026723 -0.1411122 0.5891039 -0.0449691 -0.0325802 0.0880462 0.1953344 -0.1158492 0.0014459 -0.0981999 0.2225167 0.1823446 -0.0834959 0.0830053 -0.1749956 0.1618034 -0.0885517 0.1268055 -0.046355 0.2263365 0.1058834 0.0677495 0.0392504 0.0582291 0.1708796 -0.1066326 0.0117368 -0.0746452 0.2947282 0.1047235 -0.0386925 -0.0261038 -0.0105877 0.094805 0.0323747 -0.0148961 -0.0194864 -0.1008873 -0.0642722 -0.1028794 0.060096 -0.067762 0.0633422 0.0034133 0.0844318 0.0239618 0.0518614 -0.018381 0.1069829 -0.0319297 0.0752578 0.0022755 0.0105977 -0.0355456 0.043215 0.1125091 0.2781495 0.1272063 -0.0766016 0.1183037 0.2418171 0.1036467 -0.055728 0.0817876 0.3198241 unknown
polarizability: 141.2858808|6.4710258|109.9487397|-6.4914452|8.9966052|105.8266607 unknown
InChI: InChI=1S/C7H14N2O3S/c1-5(10)9-2-3-13-4-6(8)7(11)12/h6,9,11H,2-4,8H2,1H3
charge 0 multiplicity 1
27 atoms
S  0.571467 -2.390719 -0.877743
O  2.810921 0.836091 -2.073512
O  0.737047 1.191063 -1.110559
O  -3.695057 -0.067415 0.98892
N  -1.847528 -0.028197 -0.434288
N  2.970844 0.38773 1.068118
C  2.360603 -0.383176 -0.028965
C  1.241093 -1.285482 0.515728
C  -1.275915 -2.484027 -0.432085
C  -2.132155 -1.34442 -1.016611
C  1.837171 0.580977 -1.110239
C  -2.664613 0.526262 0.537426
C  -2.243753 1.911891 1.025397
H  3.148128 -1.003695 -0.489184
H  1.65312 -1.91747 1.316709
H  0.401415 -0.684964 0.903829
H  -1.359867 -2.524453 0.666562
H  -1.60198 -3.455321 -0.84344
H  -3.195867 -1.564396 -0.8044
H  -1.990556 -1.298872 -2.112093
H  -1.007037 0.479375 -0.743242
H  3.898852 0.773065 0.880128
H  2.341593 1.03081 1.556281
H  -2.14705 1.893906 2.1248
H  -1.297284 2.258895 0.576731
H  -3.042047 2.635081 0.782624
H  2.482856 1.521762 -2.717891
