program: Gaussian 09
title: 000193557
version: EM64L-G09RevD.01
frameworkgroup: C1[X(C14H26O11)]
method: RPBEPBE
basis: SDD
operation: Freq
keyword: #p
keyword: freq=noraman
keyword: PBEPBE/SDD
title: #p freq=noraman PBEPBE/SDD
converged: YES YES NO NO
title: Mulliken charges:
elementType: O O O O O O O O O O O C C C C C C C C C C C C C C H H H H H H H H H H H H H H H H H H H H H H H H H H
charge: -0.280342 -0.289528 -0.299250 -0.424283 -0.459099 -0.422163 -0.418126 -0.532583 -0.288386 -0.274038 -0.478816 -0.052361 -0.106586 -0.184697 -0.027139 -0.198380 -0.080524 -0.131949 -0.093796 -0.042006 -0.317288 -0.118961 -0.348407 -0.548619 -0.509235 0.280347 0.260254 0.232269 0.210928 0.246753 0.195374 0.255899 0.226188 0.269226 0.221894 0.226683 0.285599 0.194957 0.216159 0.349226 0.359728 0.356521 0.337316 0.383925 0.402032 0.253948 0.233421 0.236532 0.233189 0.222889 0.235305
chargesum: 0.00000
title: Mulliken charges with hydrogens summed into heavy atoms:
elementType: O O O O O O O O O O O C C C C C C C C C C C C C C
charge: -0.280342 -0.289528 -0.299250 -0.075056 -0.099371 -0.065642 -0.080810 -0.148659 -0.288386 -0.274038 -0.076784 0.227986 0.153668 0.047572 0.183788 0.048373 0.114849 0.123950 0.132392 0.227220 0.131289 0.166638 0.062709 0.175282 0.182149
polarizability: 2.07146921e+02 -1.05174809e+00 2.00401175e+02 -2.84224611e+00 3.96509655e+00 1.56397556e+02
1716.lowfreq: -11.2038 -0.0008 -0.0007 -0.0003 2.4063 5.3297 23.1919 31.9814 44.4117
frequency: 23.0870 31.9238 44.4000 49.3459 68.6767 72.8759 87.4041 99.4363 105.7444 112.3604 117.4245 138.9953 141.5993 152.9949 162.9128 166.0780 178.4509 192.8849 200.3686 222.9408 228.7677 240.5037 246.2174 256.8261 273.2744 280.5885 308.7889 320.7245 325.0292 336.3666 350.0251 375.1887 387.3707 402.2787 421.2242 435.7246 447.1310 449.2978 469.2755 507.8545 532.2903 553.0372 557.6906 567.4052 578.6160 594.0432 628.7352 667.4726 685.6203 741.4526 801.8522 809.4295 829.4832 838.5598 845.6406 892.2744 899.7765 922.7421 934.1906 949.0429 963.8944 979.1394 980.8331 999.8431 1003.9160 1011.8257 1016.4341 1031.3055 1037.4844 1041.6109 1050.8591 1061.5597 1065.8040 1070.8649 1080.9222 1102.7343 1115.4754 1118.1334 1125.4619 1128.6047 1132.0201 1147.6501 1151.8151 1160.0703 1171.7850 1199.4764 1209.4445 1211.5925 1218.3068 1225.9742 1229.9044 1245.6600 1257.0778 1271.3158 1284.5443 1295.8041 1309.6180 1315.2048 1315.7725 1327.3396 1327.9750 1334.7982 1346.5420 1349.7312 1354.2445 1362.1439 1367.9300 1373.6235 1379.5088 1388.5203 1391.5783 1397.0992 1411.7521 1424.8987 1436.8333 1460.7072 1462.5326 1472.3607 1478.0950 1489.9651 1491.4949 2913.7652 2921.0197 2962.5511 2967.2651 2972.0913 2976.3120 2978.4460 3003.9266 3005.2165 3005.7415 3034.0509 3034.8705 3046.6702 3061.1156 3062.2362 3071.4058 3075.7292 3096.2092 3121.9389 3122.9372 3210.2922 3448.6623 3506.9120 3535.7098 3565.9673 3581.4268
redmass: 6.0099 4.9371 5.1130 5.6978 4.1613 4.4803 4.5360 5.6733 4.9682 3.7792 3.8379 3.8617 1.4739 2.5110 1.4450 4.0886 2.7562 3.3766 4.9220 4.2904 4.3121 4.9433 4.4057 4.0950 3.9766 3.3419 3.6977 2.3789 1.7664 5.2479 1.9676 2.2014 2.7030 4.0952 1.2403 4.3800 4.6373 1.3005 3.8164 1.5187 2.5673 3.4801 5.2236 3.7951 4.2267 4.6255 4.8801 4.2758 5.2403 4.2693 1.2319 3.5489 4.1131 4.3587 3.1411 2.0811 6.3409 2.5386 4.7668 7.0934 5.4766 3.9292 4.6510 4.3087 5.3173 4.7456 3.6556 3.8739 2.9459 3.9619 2.7004 3.6761 3.1413 3.0148 3.7880 2.7255 1.2727 2.7803 1.8449 1.2706 2.4094 1.3424 1.3996 1.5694 1.1548 1.2680 1.2347 1.2781 1.2953 1.3017 1.2476 1.3403 1.2698 1.2002 1.1854 1.3240 1.3250 1.2999 1.2700 1.2599 1.3414 1.3345 1.2315 1.2936 1.2091 1.3794 1.5239 1.2395 1.4509 1.5106 1.3971 1.1754 1.3351 1.1199 1.1556 1.0513 1.0958 1.0540 1.0565 1.0911 1.0525 1.0823 1.0824 1.0713 1.0319 1.0356 1.0762 1.0848 1.0692 1.0826 1.0799 1.0857 1.0855 1.0855 1.1034 1.0952 1.0884 1.1012 1.1037 1.1015 1.1028 1.0713 1.0651 1.0651 1.0653 1.0662 1.0662
irintensity: 0.4038 1.5103 0.4533 1.5149 0.9072 1.5293 1.4612 1.0514 1.4890 13.7734 7.8215 10.1893 5.4603 1.6851 5.4073 6.2563 10.1977 11.4820 1.0806 2.5989 6.3144 5.3281 15.7849 14.9791 15.9390 11.0578 54.1512 58.7839 87.9910 20.6804 60.7261 36.0509 6.8893 12.9263 118.5544 2.5447 18.4163 206.1557 31.8724 48.5347 39.2311 18.1069 7.2496 5.8141 12.6044 1.7582 18.0988 61.8413 39.2082 22.8100 167.0136 28.8412 19.7236 9.4772 36.7112 12.6069 20.9119 30.6138 11.8821 176.2352 32.2900 63.6027 83.2811 114.0334 164.0171 39.4862 30.5437 164.4128 29.1738 114.3208 28.3287 32.2511 109.8245 39.4119 97.0831 54.5557 0.5946 10.8894 2.1529 2.3241 18.2091 9.4067 2.1761 2.1648 51.7412 10.4368 4.6510 28.5630 26.8388 16.6018 23.6455 29.7816 7.5090 8.2083 6.1589 18.2074 30.7781 12.5679 26.4160 16.3394 3.6348 19.4155 3.2974 14.1504 16.2011 10.1669 19.6181 28.1430 4.5701 2.6449 18.9132 52.2361 5.3985 11.2568 7.4325 11.1615 8.9479 4.8349 15.6759 7.3722 8.8355 5.9454 64.6341 11.9194 60.9485 23.3232 66.9992 22.8896 49.2814 44.9217 2.8931 2.4869 13.6184 26.8985 35.1433 27.9197 47.8922 18.2634 34.0984 23.7678 15.1838 448.5881 73.8277 4.6076 16.8268 6.6402 13.6941
temp: 298.150 k
press: 1.00000 atm
elementType: 8 8 8 8 8 8 8 8 8 8 8 6 6 6 6 6 6 6 6 6 6 6 6 6 6 1 1 1 1 1 1 1 1 1 1 1 1 1 1 1 1 1 1 1 1 1 1 1 1 1 1
symmnumber: 1
zpe: 1080907.4 jmol-1
zpe.correction: 0.411696 hartree
zpe.thermalcorrener: 0.439246 hartree
zpe.thermalcorrenthalpy: 0.440190 hartree
zpe.thermalcorrgfe: 0.354166 hartree
zpe.sumelectzpe: -1374.410784 hartree
zpe.sumelectthermal: -1374.383234 hartree
zpe.sumelectthermalent: -1374.382290 hartree
zpe.sumelectthermalfe: -1374.468314 hartree
dipole: -1.7324 2.9801 1.7859
dipole: 3.8822
quadrupole: -151.1875 -150.2901 -153.4601
quadrupole: 16.6942 -14.3140 6.1615
quadrupole: 0.4584 1.3558 -1.8142 16.6942 -14.3140 6.1615
hfenergy: -1374.82248 hartree
pointgroup: C01 [X(C14H26O11)]
dipole: 0.8519124 1.0811815 -0.6619563 debye
polarizability: 207.5070311|0.4699776|200.1872867|-0.2242345|-3.9589721|156.2513336 unknown
InChI: InChI=1S/C14H26O11/c1-21-13(22-2)10(20)12-11(5(16)4-23-12)25-14-9(19)8(18)7(17)6(3-15)24-14/h5-20H,3-4H2,1-2H3
charge 0 multiplicity 1
51 atoms
O  -0.710859 1.72311 -0.649669
O  2.908535 1.788669 0.021115
O  -1.274952 -0.446934 0.062699
O  0.342158 4.113316 1.189786
O  -3.626023 2.280681 -1.023044
O  -5.207328 -0.075644 -1.317021
O  -3.065755 -2.092322 -1.445745
O  1.532409 -0.512416 1.580822
O  3.52868 -2.137759 0.76799
O  3.22915 -1.398059 -1.535032
O  -0.488115 -2.370523 2.085585
C  0.501686 1.808494 0.193819
C  1.695646 1.005036 -0.372602
C  1.023394 3.257325 0.22404
C  -1.758341 0.939816 -0.059853
C  -2.98563 0.959161 -0.983281
C  -4.058119 -0.005869 -0.429779
C  -3.48419 -1.430876 -0.208228
C  -2.282646 -1.306205 0.761509
C  1.811249 -0.441512 0.132807
C  2.481371 3.05913 0.662613
C  3.21903 -1.023389 -0.144275
C  -1.53664 -2.600023 1.100659
C  2.699612 -3.355539 0.57212
C  4.586507 -1.586287 -2.079589
H  0.276252 1.474996 1.224305
H  1.648026 0.979214 -1.478889
H  0.963522 3.678086 -0.801719
H  -2.014109 1.317816 0.958663
H  -2.672861 0.643526 -1.999746
H  -4.365662 0.390553 0.567486
H  -4.278911 -2.075621 0.204012
H  -2.583795 -0.806087 1.707346
H  1.050881 -1.047241 -0.39136
H  2.529688 2.971589 1.765203
H  3.161239 3.853763 0.318155
H  4.007499 -0.28493 0.092773
H  -1.141827 -3.04883 0.165011
H  -2.236928 -3.32078 1.5580
H  -0.580062 4.284251 0.8715
H  -3.040575 2.902032 -1.523919
H  -5.479804 0.858941 -1.513453
H  -2.206889 -1.677391 -1.72679
H  2.312903 -0.964962 2.006989
H  0.107789 -1.598476 1.823772
H  1.674125 -3.213898 0.96434
H  3.208069 -4.140465 1.151955
H  2.667678 -3.628472 -0.497005
H  5.123658 -2.384449 -1.534705
H  5.162737 -0.642517 -2.017842
H  4.449327 -1.873135 -3.133035
