program: Gaussian 09
title: 000193544
version: EM64L-G09RevD.01
frameworkgroup: C1[X(C22H29NO2)]
method: RPBEPBE
basis: SDD
operation: Freq
keyword: #p
keyword: freq=noraman
keyword: PBEPBE/SDD
title: #p freq=noraman PBEPBE/SDD
converged: NO YES NO NO
title: Mulliken charges:
elementType: O O N C C C C C C C C C C C C C C C C C C C C C C H H H H H H H H H H H H H H H H H H H H H H H H H H H H H
charge: -0.270975 -0.250890 -0.036756 -0.101726 -0.191164 -0.168056 0.276068 0.249569 -0.546330 -0.516047 -0.491523 0.479488 -0.562407 -0.520806 0.360527 -0.473390 -0.830442 -0.809926 -0.679948 -0.483984 -0.361885 0.029230 -0.275527 0.285566 -0.762022 0.203861 0.250890 0.225317 0.225313 0.223842 0.213848 0.220739 0.216177 0.215472 0.233580 0.235599 0.211064 0.222785 0.216234 0.228856 0.225257 0.222246 0.234731 0.229407 0.236215 0.256109 0.219518 0.218432 0.219576 0.258630 0.251184 0.247198 0.246457 0.244819
chargesum: 0.00000
title: Mulliken charges with hydrogens summed into heavy atoms:
elementType: O O N C C C C C C C C C C C C C C C C C C C C C C
charge: -0.270975 -0.250890 -0.036756 0.102135 0.059726 0.057261 0.276068 0.249569 -0.097175 -0.081460 -0.059874 0.479488 -0.093228 -0.086957 0.360527 -0.257156 -0.154083 -0.109573 -0.204321 -0.045976 -0.103255 0.280414 -0.275527 0.285566 -0.023547
polarizability: 3.13462977e+02 7.54423214e+00 2.34005991e+02 1.03886090e+01 -4.44739389e-01 1.70627520e+02
1716.lowfreq: -14.8985 -6.9906 -3.7885 -0.0008 -0.0006 -0.0003 15.1885 22.3670 38.3236
frequency: 15.1653 22.2746 38.1272 52.2973 59.3698 68.7152 88.2815 92.0741 145.2923 152.2594 158.2051 183.3803 189.2306 218.9780 221.7075 232.2987 246.3615 249.1668 277.2343 280.3829 294.9306 306.7157 332.5001 340.1891 348.9280 375.4682 393.3808 404.6472 425.1000 429.3092 443.4801 450.3537 478.4729 495.2906 518.7478 528.2971 566.6688 583.6091 590.7565 606.6716 619.3803 635.3295 654.1340 682.5916 706.2895 734.4442 796.1484 806.8856 821.6743 831.8367 842.5615 843.8344 856.8657 885.9981 893.6461 913.7053 926.0112 936.1870 940.2277 961.8684 965.4361 979.7699 989.6684 991.7755 998.0866 1008.1579 1020.2307 1028.2054 1040.3127 1050.3140 1066.2037 1075.2894 1090.7613 1098.3591 1116.9013 1128.8326 1131.5900 1138.2244 1141.2735 1156.2184 1164.8740 1182.4177 1188.2041 1197.7436 1199.9454 1206.3661 1224.3461 1240.3848 1253.8802 1254.3950 1262.9196 1267.8629 1272.4640 1276.9842 1292.0947 1298.3447 1314.2997 1324.3421 1326.4017 1330.1845 1337.1734 1341.1470 1345.9985 1346.8679 1354.3856 1369.4787 1374.9135 1381.2552 1388.7490 1391.1708 1452.6357 1454.5833 1456.2802 1457.5725 1460.5965 1461.2786 1461.7488 1469.7769 1474.0134 1480.2247 1482.5765 1490.0725 1494.8984 1597.9728 1644.9781 1683.2553 2162.2859 2921.4391 2924.6145 2927.9714 2957.8487 2965.5856 2967.1250 2973.9680 2976.6500 2983.5485 2984.3358 2996.8480 2997.8112 2999.8921 3006.7206 3017.0297 3031.0493 3038.4523 3041.8295 3053.4826 3056.3113 3061.8611 3073.0656 3075.1181 3081.0759 3087.2685 3092.2451 3094.7045 3142.2841 3164.5627
redmass: 1.1638 4.9951 6.1527 4.1407 4.4070 3.2397 6.2363 3.8403 2.9675 3.5486 3.5714 1.5756 3.0522 1.7190 2.2851 2.1072 2.2458 3.1218 2.6668 2.3639 2.2673 2.6723 2.9209 2.5021 2.7820 3.0092 3.0551 3.7565 3.8703 3.9339 2.4772 2.9977 3.5188 2.9953 3.7918 3.0568 3.1695 3.0721 3.7920 4.6276 4.6737 3.2192 4.5945 3.0048 3.1794 2.9029 1.7710 1.8900 1.9421 2.5436 2.1142 1.4354 3.0490 1.8307 1.8174 1.9431 2.0497 1.9273 2.2713 2.2079 1.8242 1.8792 2.2841 2.0584 2.1221 2.0806 2.0443 1.8400 1.6701 2.1468 2.4417 2.4812 2.6100 1.6914 1.7017 1.6454 2.2848 1.7973 1.9867 2.0381 1.9398 2.1264 2.2989 2.1924 1.9453 3.5743 1.8281 1.4312 1.3679 1.5094 1.5376 1.9677 1.4931 1.3296 1.3212 1.4198 1.3370 1.4785 1.3221 1.5282 1.3927 1.3417 1.4531 1.6258 1.4178 1.4748 1.5026 1.2756 1.1978 1.2322 1.0641 1.0473 1.0899 1.0880 1.0845 1.0773 1.0786 1.0851 1.0878 1.0696 1.0636 1.0557 1.0626 7.4475 9.2118 7.8007 12.6173 1.0821 1.0778 1.0683 1.0672 1.0658 1.0629 1.0607 1.0812 1.0388 1.0364 1.0657 1.0686 1.0796 1.0367 1.0843 1.1007 1.0963 1.0936 1.1009 1.0985 1.0995 1.0991 1.0992 1.0972 1.0982 1.0903 1.0973 1.1009 1.0964
irintensity: 1.3932 1.6553 1.4268 1.0791 0.4408 2.5074 3.4116 0.2343 2.3218 1.1206 2.5452 0.6381 0.3265 0.1359 0.1512 0.4089 0.7514 1.0442 2.3024 1.8569 2.0806 3.5657 4.3139 0.2822 1.6603 0.1573 2.0759 0.3201 0.6697 1.1315 3.0863 1.0119 0.7406 1.1205 0.0976 2.8051 2.0990 0.2560 8.7227 1.8872 1.4717 1.3119 3.6940 2.6010 2.1424 4.4068 5.5146 10.6083 6.8819 7.5702 3.8134 19.7434 14.7241 6.7836 2.0776 4.5853 2.2065 9.5983 42.6495 23.3107 22.1474 3.4882 15.9979 2.3382 145.4532 3.4532 9.4288 11.8432 8.0325 7.8392 12.3855 3.7952 12.5972 5.6760 4.1106 1.9465 8.4746 14.3996 4.3761 7.3044 2.6633 0.9614 3.7230 9.2781 4.1040 411.4191 2.0036 0.4558 1.0538 2.3790 1.6048 5.4948 1.3566 9.2742 2.2865 0.7701 1.3478 1.0310 0.2998 1.4999 0.7191 2.8739 0.7492 0.5065 1.0093 8.6061 11.6914 52.1613 11.3440 28.7226 25.7516 19.1345 7.3517 9.7118 7.8647 4.5667 11.2154 9.1850 0.8459 5.7012 28.1268 2.1647 8.4467 9.3342 164.3591 1.8086 41.2052 0.8591 14.7819 44.4359 19.9248 11.4208 34.7750 26.3501 15.1905 35.6482 0.3399 57.3318 14.0485 34.3381 3.3806 12.5314 9.8751 48.8631 29.5121 51.3478 19.9101 39.6045 14.8267 31.2343 48.4162 30.4114 38.1742 8.4918 11.9962 11.8438
temp: 298.150 k
press: 1.00000 atm
elementType: 8 8 7 6 6 6 6 6 6 6 6 6 6 6 6 6 6 6 6 6 6 6 6 6 6 1 1 1 1 1 1 1 1 1 1 1 1 1 1 1 1 1 1 1 1 1 1 1 1 1 1 1 1 1
symmnumber: 1
zpe: 1208219.9 jmol-1
zpe.correction: 0.460187 hartree
zpe.thermalcorrener: 0.484362 hartree
zpe.thermalcorrenthalpy: 0.485306 hartree
zpe.thermalcorrgfe: 0.405789 hartree
zpe.sumelectzpe: -1059.034567 hartree
zpe.sumelectthermal: -1059.010391 hartree
zpe.sumelectthermalent: -1059.009447 hartree
zpe.sumelectthermalfe: -1059.088964 hartree
dipole: 3.2390 0.8808 2.2601
dipole: 4.0466
quadrupole: -187.4975 -149.3383 -151.9795
quadrupole: -27.4106 -1.6185 1.5800
quadrupole: -24.5591 13.6001 10.9589 -27.4106 -1.6185 1.5800
hfenergy: -1059.4947534 hartree
pointgroup: C01 [X(C22H29N1O2)]
dipole: 1.2679874 -0.3862342 -0.8818651 debye
polarizability: 313.3062188|-8.0677503|233.8535363|-11.0387286|-3.1742031|170.936733 unknown
InChI: InChI=1S/C22H29NO2/c1-14(24)25-17-8-10-21(2)15(12-17)4-6-18-19-7-5-16(13-23)22(19,3)11-9-20(18)21/h4-5,17-20H,6-12H2,1-3H3
charge 0 multiplicity 1
54 atoms
O  5.329208 0.61252 -0.138896
O  5.950242 -1.266318 1.103325
N  -6.846642 1.406415 0.884026
C  -0.496185 0.419946 0.185995
C  -1.186502 -0.86818 -0.377712
C  -2.602865 -0.952973 0.212002
C  0.942107 0.631022 -0.426149
C  -3.486343 0.289973 -0.132595
C  -1.388229 1.698198 0.092591
C  -2.855416 1.509762 0.575513
C  -0.35236 -2.114221 -0.000241
C  1.724724 -0.699449 -0.407749
C  -3.531142 -2.171377 -0.047356
C  1.71437 1.665452 0.46724
C  -4.855007 -0.226118 0.369685
C  1.132422 -1.906019 -0.196738
C  0.873433 1.155895 -1.894532
C  -3.64745 0.55343 -1.661038
C  3.228805 -0.617698 -0.654714
C  3.221909 1.789338 0.144933
C  -4.882885 -1.596806 0.360625
C  3.896459 0.421513 0.267825
C  -5.956585 0.638446 0.651796
C  6.257487 -0.311783 0.352525
C  7.645564 0.018227 -0.154395
H  -0.342523 0.215318 1.271174
H  -1.239035 -0.805934 -1.483691
H  -2.477178 -0.920983 1.318751
H  -1.406357 2.068001 -0.948695
H  -0.92835 2.504167 0.694919
H  -2.874291 1.345606 1.671541
H  -3.429834 2.435278 0.375051
H  -0.686744 -2.988033 -0.595977
H  -0.550652 -2.384887 1.061414
H  -3.254588 -3.067977 0.536063
H  -3.545413 -2.475266 -1.116406
H  1.599623 1.364258 1.529377
H  1.245338 2.661935 0.36438
H  1.764899 -2.805599 -0.166756
H  1.86465 1.127612 -2.378679
H  0.194831 0.535453 -2.507187
H  0.520009 2.20215 -1.934374
H  -2.699038 0.853822 -2.136837
H  -4.022848 -0.34249 -2.187352
H  -4.377295 1.367825 -1.824376
H  3.691118 -1.608192 -0.500812
H  3.436971 -0.313144 -1.701191
H  3.373821 2.175952 -0.880656
H  3.699013 2.50867 0.836019
H  -5.764587 -2.205025 0.585652
H  3.887072 0.056548 1.312993
H  7.926286 1.043143 0.143768
H  7.664903 -0.018208 -1.25758
H  8.370579 -0.700497 0.2536
