program: Gaussian 09
title: 000193537
version: EM64L-G09RevD.01
frameworkgroup: C1[X(C6H13O9P)]
method: RPBEPBE
basis: SDD
operation: Freq
keyword: #p
keyword: freq=noraman
keyword: PBEPBE/SDD
title: #p freq=noraman PBEPBE/SDD
converged: YES YES NO NO
title: Mulliken charges:
elementType: P O O O O O O O O O C C C C C C H H H H H H H H H H H H H
charge: 1.426686 -0.257918 -0.599862 -0.449509 -0.425953 -0.436785 -0.457612 -0.642031 -0.703330 -0.598816 0.321447 -0.183223 -0.131262 -0.154764 -0.444322 -0.364982 0.271476 0.282233 0.277928 0.241817 0.231701 0.227296 0.227845 0.377322 0.345338 0.387119 0.400935 0.411829 0.419395
chargesum: 0.00000
title: Mulliken charges with hydrogens summed into heavy atoms:
elementType: P O O O O O O O O O C C C C C C
charge: 1.426686 -0.257918 -0.599862 -0.072187 -0.080615 -0.049666 -0.056676 -0.230202 -0.283935 -0.598816 0.321447 0.088253 0.150971 0.123163 0.029197 0.090159
polarizability: 1.33694209e+02 -1.89757488e+00 1.14988355e+02 4.26258760e-01 4.01886412e+00 1.00143537e+02
1716.lowfreq: -9.6122 -4.6568 -0.0009 0.0014 0.0015 6.0206 42.1775 63.4305 80.0313
frequency: 42.1025 63.3613 80.0148 104.3781 121.5533 130.1940 141.9856 151.9629 162.7174 192.8983 202.0546 216.6592 226.9700 256.0099 271.8758 288.5571 306.4813 320.3032 336.5030 341.9486 350.1620 367.8397 395.9744 405.4249 427.3786 505.8769 515.5770 569.2807 589.9297 596.7191 614.5614 668.4539 709.4056 735.4850 763.8443 798.0111 819.5367 856.9082 917.9656 944.5942 958.7834 969.5407 981.6695 1006.2758 1016.9394 1017.5894 1030.2923 1046.3879 1070.2449 1074.3514 1098.3531 1127.7334 1191.9130 1196.5341 1212.4275 1242.5153 1262.5281 1273.0106 1319.0856 1325.7873 1337.4218 1363.5874 1367.4202 1372.5777 1376.7308 1396.5454 1449.2466 1463.7076 2990.0828 2990.3751 3021.5808 3061.7887 3066.0523 3086.4164 3109.6121 3437.6990 3450.6884 3538.0119 3542.6874 3574.8327 3596.3440
redmass: 6.8202 5.6925 6.5766 6.6985 4.7804 6.9820 2.7259 3.3577 3.8667 3.0260 3.7573 4.3263 2.6201 1.9219 3.0363 2.9002 1.7640 3.5932 2.6427 2.8972 1.5805 4.0689 7.0820 5.0401 4.4738 3.9198 7.1052 3.7049 1.1737 1.2460 5.3034 7.2049 6.2647 4.3688 8.9759 5.9910 4.8927 2.5962 2.7443 3.8943 1.6977 4.8968 2.2103 4.9769 2.5509 1.3959 4.7014 3.3334 2.4493 2.6246 2.7108 1.7507 1.6997 1.2851 1.1939 1.4333 1.4620 1.4278 1.2600 1.2949 1.4098 1.2265 1.2302 1.2710 1.2051 1.1558 1.0753 1.0855 1.0628 1.0597 1.0867 1.1036 1.0964 1.0923 1.0879 1.0672 1.0668 1.0661 1.0650 1.0665 1.0665
irintensity: 7.2489 0.8250 1.5456 4.2320 8.2246 0.4676 27.1528 50.9260 18.6830 25.0092 57.6367 18.5757 13.3036 20.8116 5.0912 36.7801 73.0682 67.0582 13.6212 25.2237 146.5287 15.1302 81.9389 37.3316 2.3421 0.3769 18.8172 35.3487 187.3415 49.8118 122.1108 18.8314 73.9252 43.0544 178.7578 248.6012 329.5008 26.9746 39.7538 116.6506 51.5654 44.0821 17.0274 119.4011 13.5530 32.3179 100.1692 43.4302 89.1944 16.4522 130.3448 5.6113 27.6254 22.7046 28.1481 12.2202 15.5822 7.5042 2.1072 2.4852 35.2776 5.5594 28.2115 4.5892 40.9448 40.5944 14.0268 9.4252 15.3866 28.6491 18.2958 22.3235 12.0591 30.6218 6.1649 111.9303 104.2987 9.5566 31.6534 78.2012 96.4173
temp: 298.150 k
press: 1.00000 atm
elementType: 15 8 8 8 8 8 8 8 8 8 6 6 6 6 6 6 1 1 1 1 1 1 1 1 1 1 1 1 1
symmnumber: 1
zpe: 553433.3 jmol-1
zpe.correction: 0.210792 hartree
zpe.thermalcorrener: 0.229179 hartree
zpe.thermalcorrenthalpy: 0.230124 hartree
zpe.thermalcorrgfe: 0.165722 hartree
zpe.sumelectzpe: -1253.332349 hartree
zpe.sumelectthermal: -1253.313961 hartree
zpe.sumelectthermalent: -1253.313017 hartree
zpe.sumelectthermalfe: -1253.377418 hartree
dipole: 1.4840 2.2143 -1.0862
dipole: 2.8784
quadrupole: -110.5495 -114.4719 -97.6025
quadrupole: 9.7122 1.9808 5.4129
quadrupole: -3.0082 -6.9306 9.9388 9.7122 1.9808 5.4129
hfenergy: -1253.5431402 hartree
pointgroup: C01 [X(C6H13O9P1)]
dipole: -0.2995714 -1.0793704 -0.1663469 debye
polarizability: 133.1246444|4.0375358|112.4353956|1.3960273|-7.0989136|103.2660607 unknown
InChI: InChI=1S/C6H13O9P/c7-1-3-4(9)5(10)6(2-8,14-3)15-16(11,12)13/h3-5,7-12H,1-2H2
charge 0 multiplicity 1
29 atoms
P  -2.261539 -0.893887 0.077192
O  0.821216 -0.327972 -1.10266
O  -0.902501 0.010879 0.576163
O  0.837572 1.292634 1.929489
O  3.125806 1.660227 -0.895166
O  -1.808129 2.262042 -0.966035
O  1.345095 -2.83432 0.235463
O  -2.979817 -1.239884 1.579079
O  -1.486481 -2.365187 -0.398926
O  -3.273709 -0.250794 -0.959002
C  0.049662 0.669415 -0.411675
C  1.046016 1.478706 0.501178
C  2.4403 0.879884 0.13856
C  2.11347 -0.54895 -0.342736
C  -0.717561 1.467986 -1.495297
C  1.91161 -1.599694 0.765372
H  1.000476 2.552456 0.241085
H  3.100403 0.917291 1.017061
H  2.819864 -0.917219 -1.104338
H  -1.051657 0.758417 -2.278517
H  -0.002369 2.176965 -1.949737
H  1.297844 -1.173478 1.583387
H  2.898937 -1.875113 1.175817
H  -0.130632 1.136027 2.080975
H  2.677727 1.509241 -1.767616
H  -2.636047 1.706483 -0.979989
H  0.428845 -2.64725 -0.112384
H  -2.398645 -1.680322 2.252014
H  -1.996756 -2.938985 -1.025458
