program: Gaussian 09
title: 000193536
version: EM64L-G09RevD.01
frameworkgroup: C1[X(C6H11NO5S2)]
method: RPBEPBE
basis: SDD
operation: Freq
keyword: #p
keyword: freq=noraman
keyword: PBEPBE/SDD
title: #p freq=noraman PBEPBE/SDD
converged: YES YES NO NO
title: Mulliken charges:
elementType: S S O O O O O N C C C C C C H H H H H H H H H H H
charge: 0.042810 0.059871 -0.464968 -0.432656 -0.463347 -0.217882 -0.206113 -0.624695 -0.087547 -0.743020 -0.069983 -0.668948 0.221899 0.166276 0.256986 0.342813 0.294688 0.268138 0.293878 0.272474 0.304230 0.286451 0.383437 0.381621 0.403588
chargesum: 0.00000
title: Mulliken charges with hydrogens summed into heavy atoms:
elementType: S S O O O O O N C C C C C C
charge: 0.042810 0.059871 -0.081531 -0.051035 -0.059759 -0.217882 -0.206113 -0.034014 0.169439 -0.105519 0.198155 -0.102596 0.221899 0.166276
polarizability: 1.71337646e+02 2.06366975e+00 1.11853083e+02 -4.51391077e+00 3.48553277e+00 1.02038585e+02
1716.lowfreq: -3.9637 -0.0011 -0.0007 0.0018 4.6946 13.1768 16.0693 26.7259 33.2703
frequency: 13.9297 26.6252 33.2315 50.2801 56.0928 68.9637 83.4139 124.2828 138.8311 190.5947 242.5948 260.3920 262.8485 278.6601 289.8019 307.3000 324.4824 379.8735 400.6475 417.6334 472.2777 492.4648 538.5447 543.8973 588.9876 596.6884 637.5464 638.7148 670.3854 710.6148 723.0264 779.2050 800.8873 871.8615 922.3007 986.9250 1010.6375 1042.4164 1049.0737 1059.3560 1109.5481 1160.6991 1170.1906 1215.5157 1240.0138 1248.4925 1262.7199 1278.1656 1285.4736 1317.5313 1332.0212 1354.8068 1386.5296 1420.3025 1428.9331 1631.0820 1673.3348 1677.8543 2877.6385 2922.8267 3026.6707 3031.3040 3111.2992 3119.0187 3462.4059 3517.0527 3531.7157 3539.1992 3594.7575
redmass: 6.3055 7.0934 8.1950 11.2515 5.7922 7.2880 7.2135 6.0343 8.6001 5.3696 4.3492 2.2699 1.8654 2.2410 1.6036 2.6280 4.7269 4.5269 3.5852 7.2386 3.9726 6.7802 3.8180 2.4992 2.0368 1.3823 2.2915 1.7868 2.5215 5.3725 3.6553 2.8006 3.0423 2.9411 1.8406 2.6499 3.9061 2.0234 2.2010 4.3236 2.4326 1.1249 1.2107 1.4023 1.1177 1.4517 1.6424 1.4972 1.3854 1.3189 1.2308 1.2946 1.8624 1.1010 1.1107 1.0925 9.9135 9.2143 1.0796 1.0811 1.0581 1.0575 1.1079 1.1066 1.0447 1.0641 1.0652 1.0648 1.0985
irintensity: 11.2097 0.9222 0.7249 2.5422 2.7128 0.4817 2.4927 2.1609 1.5410 1.6937 2.2850 58.6795 27.9495 30.2066 24.9523 27.8599 6.6249 30.0199 11.9205 2.9539 56.5448 3.3049 11.4190 57.1846 73.1892 7.0591 185.7887 165.9868 149.8187 9.9151 6.6747 4.1197 20.4486 31.8708 8.1813 30.3471 63.5919 305.6816 246.5659 102.1504 18.6003 1.1558 3.8957 4.2891 29.2250 33.6657 25.6364 60.1368 19.1729 4.4025 2.3222 49.1202 17.2980 7.6537 20.5087 51.5710 210.6377 194.5556 36.4404 36.7468 4.3809 4.1463 9.2877 2.9849 3.3620 26.8050 40.5174 66.0975 6.0130
temp: 298.150 k
press: 1.00000 atm
elementType: 16 16 8 8 8 8 8 7 6 6 6 6 6 6 1 1 1 1 1 1 1 1 1 1 1
symmnumber: 1
zpe: 472605.0 jmol-1
zpe.correction: 0.180006 hartree
zpe.thermalcorrener: 0.197154 hartree
zpe.thermalcorrenthalpy: 0.198098 hartree
zpe.thermalcorrgfe: 0.131389 hartree
zpe.sumelectzpe: -1461.108153 hartree
zpe.sumelectthermal: -1461.091005 hartree
zpe.sumelectthermalent: -1461.090061 hartree
zpe.sumelectthermalfe: -1461.156770 hartree
dipole: -1.8595 3.6244 1.7541
dipole: 4.4352
quadrupole: -75.2509 -98.4018 -101.2788
quadrupole: -9.2085 3.4137 -1.5956
quadrupole: 16.3929 -6.7580 -9.6350 -9.2085 3.4137 -1.5956
hfenergy: -1461.2881591 hartree
pointgroup: C01 [X(C6H11N1O5S2)]
dipole: 0.3938969 0.7661419 1.5174545 debye
dipolederiv: -0.2072222 0.1222006 -0.058007 0.0781942 -0.023939 0.0420778 0.0007653 -0.0085743 -0.0576636 -0.0231166 0.0604775 0.0644114 -0.0098267 -0.0428561 0.0162974 -0.0131541 0.0084196 -0.1381933 -0.460698 -0.0164403 0.1848932 -0.046525 -0.4865314 -0.1314222 0.1186759 -0.0848548 -0.6528539 -1.2755602 0.332984 0.0646477 0.3531495 -0.4234147 0.0467552 -0.0229006 0.0669655 -0.3734995 -0.4601004 -0.0536956 -0.2624042 -0.060212 -0.4323888 -0.1106297 -0.2825872 -0.1278475 -1.2957026 -0.7374183 -0.0863465 -0.0903467 0.2251112 -0.7632151 -0.2208206 0.0489092 -0.2481211 -0.4047919 -0.9897961 0.1673971 0.2074917 0.1910743 -0.3465477 -0.1028512 0.091268 -0.0904607 -0.6499134 -0.5568299 -0.0232427 0.1749745 0.0818738 -0.518934 0.092308 0.2453643 0.1394168 -0.6624081 0.2520593 0.0099863 -0.2315773 -0.2546281 0.1400336 0.0210952 -0.1483744 -0.1087259 0.4046779 0.1649066 0.0175574 -0.0911412 -0.070116 -0.0373731 -0.0715661 -0.3075234 -0.034168 0.1014232 -0.2562013 0.0204242 -0.3693145 -0.064474 0.2917906 0.0932447 -0.3072815 0.1424768 0.3970381 0.185892 -0.0182294 0.0308372 -0.1153048 -0.0126811 0.0601599 0.1597661 -0.0352366 0.0531036 1.6213952 -0.1854148 0.1026886 -0.4070455 0.9557682 0.3565505 0.1343089 0.3621059 0.3693766 1.4429093 -0.1900146 0.1952779 -0.1731567 0.2778955 0.2146851 0.1961606 0.2311979 1.4785424 0.0548194 -0.0180887 0.0418092 -0.0216318 -0.0564303 0.0989171 0.0170846 0.0628181 -0.1422837 0.0830763 -0.009703 0.0439949 0.0372454 0.0881089 -0.0268566 0.0375686 -0.0083642 0.0129294 0.0460099 -0.0414852 0.0563787 0.0538215 0.0007504 0.0243828 0.0865397 0.0533744 0.0595576 0.1499719 -0.0382137 0.0770079 0.0885023 -0.0493044 -0.0121563 0.1164181 -0.0425794 0.0556908 -0.0580584 0.0194245 0.034294 0.0873623 0.0766932 -0.0411757 -0.0021168 -0.02059 0.0166443 -0.0166573 -0.0698741 -0.039161 -0.009832 -0.0155076 -0.0038536 -0.0629676 -0.0493858 0.0792812 0.1103386 0.0688618 0.0020961 0.1933218 0.267622 -0.1092762 -0.0192462 -0.0120987 0.2265958 0.1592162 -0.0898315 -0.0218604 -0.1323443 0.1779032 -0.1316965 -0.024171 -0.0882337 0.2043056 0.3229236 0.0001358 -0.0809071 0.0262765 0.3409094 0.0393151 -0.0569776 0.0229669 0.2544404 0.3057745 -0.0437521 -0.0469792 -0.1066033 0.1995235 -0.1240859 -0.0727263 -0.1151958 0.3023814 0.142366 0.0648829 0.0108959 0.0557676 0.3921249 -0.0193983 0.0671974 -0.015305 0.3613217 unknown
polarizability: 168.0356327|13.3645312|104.5792859|6.5795672|5.2217987|112.6143954 unknown
InChI: InChI=1S/C6H11NO5S2/c7-3(5(9)10)1-13-14-2-4(8)6(11)12/h3-4,8-9,11H,1-2,7H2
charge 0 multiplicity 1
25 atoms
S  -0.337036 -0.569619 -1.905618
S  0.422366 1.573482 -1.88501
O  1.391367 0.976419 1.122571
O  -4.881584 -0.086107 -0.925908
O  3.842758 0.463713 1.85093
O  -3.451249 -1.805152 -1.549509
O  4.63027 -0.105155 -0.268461
N  -3.036369 0.40934 1.107494
C  -2.574017 0.149988 -0.272358
C  -1.219882 -0.574418 -0.223652
C  2.230421 0.447374 0.052417
C  2.173448 1.355541 -1.18866
C  -3.62366 -0.70887 -0.982441
C  3.687915 0.237235 0.47028
H  -2.455434 1.077544 -0.885484
H  -0.54356 -0.084251 0.495609
H  -1.345104 -1.639245 0.034982
H  1.846257 -0.553139 -0.253872
H  2.81859 0.942467 -1.979255
H  2.48656 2.384833 -0.939732
H  -4.016376 0.703535 1.163508
H  -2.403227 1.021028 1.631614
H  1.901768 0.93487 1.973474
H  -5.554519 -0.656522 -1.38694
H  4.784599 0.309806 2.128822
