program: Gaussian 09
title: 000193506
version: EM64L-G09RevD.01
frameworkgroup: C1[X(C9H14N4O2)]
method: RPBEPBE
basis: SDD
operation: Freq
keyword: #p
keyword: freq=noraman
keyword: PBEPBE/SDD
title: #p freq=noraman PBEPBE/SDD
converged: YES YES NO NO
title: Mulliken charges:
elementType: O O N N N N C C C C C C C C C H H H H H H H H H H H H H H
charge: -0.321390 -0.349950 -0.192836 -0.033130 -0.384011 -0.380355 0.199690 0.054903 -0.333447 -0.419399 0.189027 -0.666156 0.245622 -0.622139 -0.612678 0.230510 0.274208 0.254068 0.246547 0.220371 0.223561 0.385444 0.319771 0.229593 0.269802 0.227952 0.231819 0.281587 0.231017
chargesum: 0.00000
title: Mulliken charges with hydrogens summed into heavy atoms:
elementType: O O N N N N C C C C C C C C C
charge: -0.321390 -0.349950 -0.192836 -0.033130 0.001433 -0.060584 0.199690 0.054903 0.171270 -0.165332 0.189027 0.024323 0.245622 0.105209 0.131744
polarizability: 1.79409388e+02 7.50896219e-01 1.54267394e+02 -2.98440529e+00 4.94100164e+00 7.81307502e+01
1716.lowfreq: -4.8280 -0.0004 0.0005 0.0006 4.7337 8.2419 39.1003 53.4821 59.6481
frequency: 39.0169 53.4591 59.6467 64.1461 79.1693 93.7572 133.0999 146.0922 156.9200 183.0157 208.9704 228.5829 267.6744 312.6001 330.5029 340.0626 357.5700 380.8924 420.2227 471.0417 539.1039 584.6732 629.5725 648.8182 693.4938 719.6887 765.6827 776.7783 790.2193 804.3435 835.6568 942.4321 946.6091 966.3800 990.0363 1035.0358 1081.7772 1092.7914 1117.5781 1122.2145 1137.7403 1140.2973 1162.0789 1186.7812 1210.9365 1249.4061 1279.8840 1315.8677 1345.3764 1359.3091 1380.0092 1387.0372 1410.8707 1418.5209 1426.9658 1446.3200 1457.2592 1469.5390 1470.2670 1481.2761 1485.8779 1487.0358 1492.0161 1536.0099 1565.7138 1587.3004 1628.4555 2977.3804 2983.1425 2993.3500 3050.4358 3055.5254 3062.6908 3074.9040 3091.0851 3100.8587 3110.8785 3119.5042 3132.3856 3206.3818 3570.6687
redmass: 3.4565 1.1632 3.5003 2.7049 3.6187 1.1594 3.4289 3.7893 3.9576 3.0927 1.5887 1.9745 6.6027 4.1707 4.6607 4.4151 3.7754 7.4738 3.7012 5.4964 4.4029 1.2006 5.0956 7.5610 4.2297 8.2687 5.8661 3.1690 1.3656 3.6577 1.5031 3.2603 1.1283 3.9480 2.8530 2.9478 3.7077 2.2613 1.3095 1.2918 1.6400 2.0013 2.1920 1.9298 2.8505 2.2744 3.9387 1.8198 4.0168 1.3072 2.2659 1.3977 1.2135 1.2680 3.0039 1.2648 1.3400 1.0491 1.0589 1.0499 1.0569 1.1099 2.1236 2.3323 4.0248 5.3993 1.5941 1.0353 1.0354 1.0351 1.0613 1.1011 1.1024 1.0941 1.0999 1.0989 1.0973 1.0980 1.1052 1.0972 1.0775
irintensity: 1.1386 0.3895 3.6732 0.6447 7.2152 0.7017 1.3883 0.5916 4.1153 3.8426 0.7232 0.4583 9.6192 1.8023 10.0229 22.6565 10.3716 12.6762 5.7663 18.8670 9.7854 91.8064 10.0834 2.1958 8.6921 20.5609 3.2357 3.8383 7.2842 3.0631 20.5901 53.8479 114.0286 15.6518 11.5736 4.5338 2.5452 12.5096 1.0536 0.1410 66.7072 25.3741 21.6517 5.6338 19.3370 82.4556 21.4086 24.0969 35.5925 9.3277 48.3834 6.9289 29.2708 54.4320 15.4594 64.9655 59.3747 2.5508 24.4240 6.1963 19.5806 10.7121 36.2886 400.6243 221.6358 181.9580 19.9994 83.3657 83.9434 24.8977 23.5282 34.0928 32.9786 638.6698 35.2225 24.4685 6.1248 1.3793 2.2306 3.7794 22.9625
temp: 298.150 k
press: 1.00000 atm
elementType: 8 8 7 7 7 7 6 6 6 6 6 6 6 6 6 1 1 1 1 1 1 1 1 1 1 1 1 1 1
symmnumber: 1
zpe: 612827.0 jmol-1
zpe.correction: 0.233413 hartree
zpe.thermalcorrener: 0.249335 hartree
zpe.thermalcorrenthalpy: 0.250279 hartree
zpe.thermalcorrgfe: 0.188947 hartree
zpe.sumelectzpe: -719.696466 hartree
zpe.sumelectthermal: -719.680545 hartree
zpe.sumelectthermalent: -719.679601 hartree
zpe.sumelectthermalfe: -719.740933 hartree
dipole: -3.6002 -1.6163 0.0558
dipole: 3.9467
quadrupole: -75.7718 -86.8246 -91.2761
quadrupole: 4.7911 5.2038 1.8312
quadrupole: 8.8524 -2.2005 -6.6520 4.7911 5.2038 1.8312
hfenergy: -719.9298799 hartree
pointgroup: C01 [X(C9H14N4O2)]
dipole: -1.4834511 -0.4533766 0.0699795 debye
polarizability: 178.4887382|-1.3498054|152.675277|-8.7658812|12.8387601|80.643517 unknown
InChI: InChI=1S/C9H14N4O2/c1-4-13-7(9(15)11-3)6(5-12-13)8(14)10-2/h5,10-11H,4H2,1-3H3
charge 0 multiplicity 1
29 atoms
O  2.503843 1.286134 -0.555502
O  -1.891798 1.351881 0.961343
N  1.374357 -1.35496 -0.299444
N  0.588605 -2.501449 -0.26127
N  0.615746 2.185442 0.484615
N  -3.121389 -0.439104 0.160937
C  0.650411 -0.196801 -0.038949
C  -0.703303 -0.623889 0.147706
C  2.828311 -1.54836 -0.524989
C  -0.666645 -2.046276 -0.001277
C  1.328859 1.151214 -0.062247
C  3.62207 -1.545587 0.795114
C  -1.91743 0.17356 0.448084
C  1.150947 3.549652 0.50576
C  -4.415435 0.185945 0.457891
H  2.912318 -2.522245 -1.033787
H  3.178143 -0.737177 -1.178917
H  -1.472563 -2.771371 0.110102
H  3.564044 -0.556853 1.280389
H  4.685238 -1.757174 0.582138
H  3.244748 -2.317539 1.488685
H  -0.356908 1.999259 0.82672
H  -3.10935 -1.334753 -0.327262
H  0.528403 4.226789 -0.108899
H  2.173707 3.53311 0.097028
H  1.176818 3.940493 1.539556
H  -4.984681 0.384283 -0.468886
H  -4.216047 1.143015 0.963888
H  -5.022519 -0.455941 1.122176
