program: Gaussian 09
title: 000193505
version: EM64L-G09RevD.01
frameworkgroup: C1[X(C10H13NO3)]
method: RPBEPBE
basis: SDD
operation: Freq
keyword: #p
keyword: freq=noraman
keyword: PBEPBE/SDD
title: #p freq=noraman PBEPBE/SDD
converged: YES YES NO NO
title: Mulliken charges:
elementType: O O O N C C C C C C C C C C H H H H H H H H H H H H H
charge: -0.401632 -0.441509 -0.248360 -0.573159 -0.597646 -0.190845 0.510870 -0.398196 -0.396003 0.358703 -0.424264 -0.358823 0.206102 -0.435314 0.215059 0.227817 0.262394 0.248407 0.228933 0.231785 0.262988 0.280133 0.289172 0.232915 0.196794 0.376089 0.337592
chargesum: 0.00000
title: Mulliken charges with hydrogens summed into heavy atoms:
elementType: O O O N C C C C C C C C C C
charge: -0.025543 -0.103917 -0.248360 -0.003854 -0.154770 0.071549 0.510870 -0.149789 -0.167071 0.358703 -0.192479 -0.095835 0.206102 -0.005605
polarizability: 1.63076649e+02 -1.28041866e+01 1.08050514e+02 9.43207167e+00 1.52393532e+01 9.93961172e+01
1716.lowfreq: -6.4339 -1.1963 0.0007 0.0009 0.0009 4.8365 12.5705 28.7699 44.5510
frequency: 12.1269 28.7522 44.5446 48.7518 63.7869 129.5065 172.1804 211.9419 240.6977 259.3484 285.5442 292.1827 354.7961 379.7080 404.6479 428.3214 445.9781 490.4471 540.9120 590.4413 594.8769 628.6285 635.4938 711.2429 725.6331 762.5119 778.0138 814.1710 844.6550 853.2242 940.9570 942.8901 960.8688 975.0757 982.7261 990.3426 1014.3864 1062.1565 1091.2845 1110.2122 1137.4551 1156.5606 1183.6209 1188.7137 1213.8686 1218.0665 1259.8902 1286.7922 1290.0929 1316.8670 1325.4025 1362.4023 1387.3392 1403.0830 1412.3113 1463.3650 1467.8599 1505.3797 1582.6548 1614.0328 1623.0156 1667.0668 2957.7099 2989.7134 3047.7609 3048.0435 3067.3875 3112.3671 3113.1879 3137.1258 3148.9986 3478.0824 3493.5424 3555.9939 3615.8624
redmass: 6.0660 5.9824 4.6758 3.9983 3.7159 3.7108 5.2797 1.5238 3.9332 2.7740 2.6395 2.2231 1.8273 1.7029 2.8618 5.0605 3.3969 2.3381 1.6830 3.5116 3.1812 1.3407 6.5319 3.4174 4.3438 2.8074 3.9071 2.2684 2.4201 1.2697 1.7613 1.6178 2.7142 1.3854 1.8762 4.5823 2.8677 2.6366 1.5072 1.7232 1.3616 1.1103 1.3869 1.1444 4.4608 1.9923 1.6021 1.3453 1.4091 1.2830 1.2061 1.3974 3.4613 2.0114 2.3759 1.1106 1.0933 2.5933 6.5800 1.3202 5.9556 3.7421 1.0672 1.0597 1.0974 1.0951 1.0927 1.0873 1.0887 1.0961 1.0955 1.0444 1.0636 1.0661 1.0994
irintensity: 6.9966 2.7427 1.0432 1.4612 1.6890 0.3318 4.6487 50.6123 1.7025 17.7939 7.5597 46.8831 53.2746 108.7314 0.2366 5.3628 2.9706 58.8972 252.7857 8.6849 10.2682 233.5242 2.3027 14.6225 33.1306 2.3000 4.2248 19.9357 17.7068 1.0929 11.4239 32.0674 53.2970 0.1800 2.8042 75.2958 3.3054 203.3394 10.1530 24.2874 7.7047 17.5298 5.4577 2.8854 7.7740 3.8625 6.7113 4.7931 5.8424 1.8529 11.1275 35.0956 5.1299 13.7433 10.6165 10.7429 7.4021 20.3248 0.8621 129.7410 2.1454 113.1242 65.5416 33.7370 4.6391 20.0821 19.5398 8.1425 21.0404 18.4003 5.0988 9.5886 16.3493 5.5490 7.9329
temp: 298.150 k
press: 1.00000 atm
elementType: 8 8 8 7 6 6 6 6 6 6 6 6 6 6 1 1 1 1 1 1 1 1 1 1 1 1 1
symmnumber: 1
zpe: 566285.7 jmol-1
zpe.correction: 0.215687 hartree
zpe.thermalcorrener: 0.230240 hartree
zpe.thermalcorrenthalpy: 0.231184 hartree
zpe.thermalcorrgfe: 0.171201 hartree
zpe.sumelectzpe: -668.224195 hartree
zpe.sumelectthermal: -668.209641 hartree
zpe.sumelectthermalent: -668.208697 hartree
zpe.sumelectthermalfe: -668.268680 hartree
dipole: 0.9903 -0.5539 0.1783
dipole: 1.1486
quadrupole: -96.8938 -72.2527 -83.7552
quadrupole: -11.8420 -3.6044 -0.9759
quadrupole: -12.5933 12.0479 0.5454 -11.8420 -3.6044 -0.9759
hfenergy: -668.4398814 hartree
pointgroup: C01 [X(C10H13N1O3)]
dipole: 0.389186 -0.2281242 0.0264138 debye
polarizability: 163.1584056|-14.2319649|102.7429061|6.3558128|15.9746134|104.6219685 unknown
InChI: InChI=1S/C10H13NO3/c11-9(10(13)14)5-7-1-3-8(6-12)4-2-7/h1-4,9,12-13H,5-6,11H2
charge 0 multiplicity 1
27 atoms
O  1.864203 1.810673 -1.164942
O  -4.619041 0.55501 -1.068655
O  2.953024 1.414881 0.846082
N  3.879447 -0.909266 -0.695901
C  1.575611 -1.31838 0.342795
C  2.472672 -0.486888 -0.650802
C  0.11408 -0.903607 0.350278
C  -0.377006 0.028687 1.299584
C  -0.788127 -1.406685 -0.624308
C  -2.624615 -0.067331 0.305661
C  -1.726971 0.443887 1.274426
C  -2.13692 -0.997004 -0.64891
C  2.471138 0.981251 -0.225565
C  -4.085663 0.358947 0.291362
H  1.676654 -2.378019 0.038465
H  2.019936 -1.214829 1.350756
H  2.04593 -0.552309 -1.66558
H  0.303306 0.432595 2.05943
H  -0.430336 -2.133841 -1.36465
H  -2.085295 1.167328 2.017935
H  -2.826319 -1.393841 -1.402511
H  4.049687 -1.81198 -1.143461
H  4.389785 -0.77414 0.181469
H  -4.736757 -0.429819 0.708486
H  -4.220316 1.27295 0.908238
H  1.884146 2.752237 -0.837702
H  -4.030455 1.191593 -1.548984
