program: Gaussian 09
title: 000193487
version: EM64L-G09RevD.01
frameworkgroup: C1[X(C6H11NO6)]
method: RPBEPBE
basis: SDD
operation: Freq
keyword: #p
keyword: freq=noraman
keyword: PBEPBE/SDD
title: #p freq=noraman PBEPBE/SDD
converged: YES YES NO NO
title: Mulliken charges:
elementType: O O O O O O N C C C C C C H H H H H H H H H H H
charge: -0.438456 -0.483412 -0.411876 -0.379902 -0.196047 -0.273713 -0.684357 -0.097497 -0.199727 -0.182237 -0.177875 -0.081629 0.213986 0.245545 0.235530 0.288875 0.299233 0.379820 0.299115 0.331678 0.190574 0.382996 0.354237 0.385138
chargesum: 0.00000
title: Mulliken charges with hydrogens summed into heavy atoms:
elementType: O O O O O O N C C C C C C
charge: -0.058636 -0.100415 -0.057639 0.005236 -0.196047 -0.273713 -0.053564 0.148048 0.035803 0.106639 0.121358 0.108945 0.213986
polarizability: 1.18944124e+02 -2.47763806e+00 8.04077662e+01 3.47121834e+00 -6.13722308e-01 7.88592554e+01
1716.lowfreq: -16.0063 -8.2420 0.0003 0.0008 0.0009 7.4049 35.1628 44.4759 60.7590
frequency: 35.0569 44.4643 60.7344 81.7901 97.9247 136.1220 190.2180 222.3007 236.8067 260.8745 270.7774 302.9761 322.6161 336.4348 362.2621 456.9578 465.0482 515.6613 580.3347 625.5708 650.1091 667.9223 681.2141 727.4207 751.0116 801.9809 820.1807 841.1568 864.4469 912.2981 939.9266 946.3931 969.7005 1033.0724 1039.5960 1051.9067 1081.7401 1109.6487 1173.4159 1188.0901 1211.7342 1229.0474 1248.5042 1253.2760 1305.3971 1333.8105 1352.5546 1355.0766 1371.1527 1381.5322 1390.3945 1422.1601 1607.4570 1613.2568 1650.0992 2926.8748 2967.4847 2988.0045 3031.7909 3105.5282 3113.5866 3416.5142 3416.8348 3433.8339 3489.3046 3578.0121
redmass: 5.3254 6.0089 9.1828 5.9232 7.2177 5.4265 7.8270 5.5715 3.9873 4.5643 6.5036 3.9358 3.8172 5.5130 1.2419 4.5739 3.7549 1.1548 4.1544 1.3192 1.2876 2.8239 3.6067 4.5248 3.5957 1.6369 2.4796 1.2035 3.4277 3.4850 2.6367 2.1937 4.2239 3.6782 3.6372 2.2078 2.0814 1.8341 1.3854 1.3920 1.2981 1.2463 1.3165 1.4026 1.4216 1.2603 1.5988 1.5355 1.2217 1.5539 1.3048 1.3546 1.9578 7.6047 1.9049 1.0873 1.0830 1.0843 1.0843 1.0641 1.0872 1.0590 1.0580 1.0646 1.0638 1.0912
irintensity: 0.7488 4.3675 0.4178 12.0158 3.2542 6.6861 7.0330 3.7591 15.3607 8.5544 3.9251 5.0132 7.2592 14.3799 5.6428 10.8115 19.4400 77.5291 56.9369 150.5295 225.6181 29.5905 32.3925 48.4997 59.0849 203.1596 30.6592 83.7350 51.1006 11.9297 70.7229 10.6401 28.7031 41.8659 52.6316 65.4497 227.8468 21.2320 48.9341 15.0669 49.3491 3.5236 46.5234 49.1237 9.8752 33.4743 13.0494 23.2766 5.7492 67.5228 65.8927 47.0664 180.7518 186.0429 71.4722 62.1195 23.1639 22.4288 41.5473 170.9958 2.5954 83.8554 6.6583 48.6915 23.3574 20.8156
temp: 298.150 k
press: 1.00000 atm
elementType: 8 8 8 8 8 8 7 6 6 6 6 6 6 1 1 1 1 1 1 1 1 1 1 1
symmnumber: 1
zpe: 478801.7 jmol-1
zpe.correction: 0.182366 hartree
zpe.thermalcorrener: 0.196370 hartree
zpe.thermalcorrenthalpy: 0.197314 hartree
zpe.thermalcorrgfe: 0.140586 hartree
zpe.sumelectzpe: -740.263207 hartree
zpe.sumelectthermal: -740.249203 hartree
zpe.sumelectthermalent: -740.248259 hartree
zpe.sumelectthermalfe: -740.304987 hartree
dipole: -1.9058 -2.1983 -3.3113
dipole: 4.4078
quadrupole: -79.4863 -82.4377 -73.2440
quadrupole: -5.7702 0.1694 -5.0119
quadrupole: -1.0969 -4.0484 5.1453 -5.7702 0.1694 -5.0119
hfenergy: -740.445573 hartree
pointgroup: C01 [X(C6H11N1O6)]
dipole: -0.7638844 1.4050153 -0.6706185 debye
dipolederiv: -0.7374402 -0.0107938 0.006012 -0.0391239 -0.4120401 0.0521365 -0.0575038 -0.0470443 -0.6886924 -0.6665335 -0.1522672 -0.0501269 -0.1546873 -0.4671208 0.0925317 -0.1243811 0.0869696 -0.7519191 -0.6985262 -0.0150527 -0.0585413 -0.0021666 -0.5518403 -0.1566898 -0.0541154 -0.1780243 -0.2905865 -0.8228681 -0.1189849 0.5533577 -0.0519447 -0.3216656 -0.0427594 0.5308937 0.0038989 -0.7830562 -1.0450644 0.0958094 -0.0077258 0.0230836 -0.4228151 -0.0708785 -0.2347808 -0.0383969 -0.3079377 -0.7454291 0.1798329 -0.0484009 0.0499353 -0.5220986 0.3143628 0.2043452 0.2543758 -0.8226246 -0.5255829 -0.0904614 0.1679765 -0.2074096 -0.5290354 -0.1005214 0.1383813 -0.0824178 -0.5803544 0.4901217 -0.048056 0.0256091 0.0014671 0.1693842 0.0073599 0.1240084 0.1072663 0.4277189 0.1974941 0.0653734 0.0625416 0.0924917 0.194625 -0.0340136 0.1900636 0.0043193 0.4587117 -0.4086428 0.3355487 0.1298087 0.4324393 0.1977167 0.067021 -0.0595646 0.0144659 0.1482866 0.1789865 0.0002221 0.0759168 0.0768375 0.3183731 0.164794 -0.007872 0.1480886 0.1890949 1.2603481 -0.1743751 0.0470454 -0.3971049 0.6037933 0.2358982 0.2490393 0.1727504 0.1626564 1.1435201 -0.215196 -0.4111283 -0.2657641 0.4558285 -0.4019983 -0.6222516 -0.3565874 1.1955943 0.0973288 -0.0094487 -0.0149935 0.0124011 -0.0848555 -0.062971 -0.0184659 -0.0553939 0.0224307 0.0580707 -0.0205141 -0.0150668 -0.0058833 -0.1323462 -0.0755229 -0.0026511 -0.0578609 -0.0336847 0.2400476 -0.0224165 -0.0339197 0.0379528 0.0353486 -0.0015076 0.0346317 -0.0311776 -0.0416034 0.1323531 0.0162084 -0.0046907 0.0400987 0.0600325 0.0206256 -0.0054314 -0.0195779 -0.0132818 0.4400319 0.0832753 -0.1029171 0.0987355 0.2933544 -0.0913509 -0.0834213 -0.0340852 0.3592682 0.2263803 0.0135089 -0.0698297 0.0292367 0.1109218 0.0290221 -0.0591726 0.0799315 0.2257883 0.155825 -0.0893215 -0.0604146 -0.0005619 0.2452387 0.0326871 0.0409562 0.0322193 0.2962394 0.0109391 -0.0855439 -0.058842 -0.0250079 -0.1500237 -0.1290506 -0.0439226 -0.1136034 0.0399273 0.3752852 0.0919722 -0.1087351 0.0635645 0.2938316 -0.0344879 -0.0545729 -0.0526829 0.3485357 0.4051969 0.0663918 0.0391565 0.0565428 0.3103044 0.104559 0.0144176 0.0640375 0.1447578 0.238158 0.1042888 -0.0620919 0.1348677 0.3050886 0.080754 -0.0986299 0.0985296 0.2947306 unknown
polarizability: 118.5972579|-3.4936046|78.7952735|-4.3763134|0.5732369|80.8186146 unknown
InChI: InChI=1S/C6H11NO6/c7-2(1-8)3(9)4(10)5(11)6(12)13/h1-5,9-12H,7H2
charge 0 multiplicity 1
24 atoms
O  1.12745 -0.151153 1.643516
O  -0.49778 0.36838 -1.659714
O  -1.718317 -1.707249 -0.301856
O  -3.795798 0.24187 1.194594
O  4.461425 -0.39323 -0.285687
O  -3.133552 1.048794 -0.875389
N  2.607511 1.540124 0.286644
C  0.937635 -0.294056 0.211666
C  -0.39632 0.374679 -0.185249
C  2.15412 0.392044 -0.519251
C  -1.596388 -0.417889 0.391093
C  3.290968 -0.609402 -0.681321
C  -2.89046 0.368968 0.160237
H  0.887327 -1.373459 -0.023287
H  -0.407788 1.412696 0.208041
H  1.804778 0.661758 -1.538949
H  -1.447278 -0.636998 1.457991
H  1.690679 0.696727 1.699253
H  2.317926 2.457648 -0.060178
H  3.619447 1.48991 0.47619
H  3.010665 -1.568272 -1.178885
H  -1.340212 0.853458 -1.894301
H  -1.48457 -1.522558 -1.256413
H  -4.642369 0.72231 0.977354
