program: Gaussian 09
title: 000193451
version: EM64L-G09RevD.01
frameworkgroup: C1[X(C14H18O)]
method: RPBEPBE
basis: SDD
operation: Freq
keyword: #pfreq=noraman
keyword: PBEPBE/SDD
title: #p freq=noraman PBEPBE/SDD
converged: YES YES NO NO
title: Mulliken charges:
elementType: O C C C C C C C C C C C C C C H H H H H H H H H H H H H H H H H H
charge: -0.222057 0.295387 -0.149175 -0.502244 -0.509054 -0.189008 -0.181830 -0.425017 -0.166834 -0.754673 0.144006 -0.749771 -0.366347 0.203437 -0.541839 0.234177 0.225473 0.230170 0.233647 0.197333 0.237635 0.231104 0.210148 0.212679 0.227284 0.224448 0.217442 0.225874 0.210221 0.240429 0.229633 0.246996 0.280327
chargesum: 0.00000
title: Mulliken charges with hydrogens summed into heavy atoms:
elementType: O C C C C C C C C C C C C C C
charge: -0.222057 0.295387 0.085002 -0.046601 -0.078074 0.048627 0.049274 -0.002190 0.060450 -0.086909 0.144006 -0.069488 -0.119350 0.203437 -0.261513
polarizability: 1.64442421e+02 5.16497493e+00 1.38449331e+02 1.72933995e+01 -5.35366375e+00 1.22738624e+02
1716.lowfreq: -12.8746 -0.0005 -0.0004 -0.0003 9.5838 22.5282 59.5123 76.8844 80.2003
frequency: 59.4412 76.8651 80.0289 137.2075 166.8369 172.0281 202.9648 216.6945 233.3834 260.0237 280.7108 301.6893 327.9683 339.4257 386.9613 411.0186 416.9486 453.2828 494.0028 518.4373 532.1827 560.2120 633.2584 637.1955 638.5399 671.9925 699.0051 724.9109 771.7873 796.3748 820.9116 830.2840 877.5949 912.4832 933.3377 958.6943 969.8921 982.4422 998.1733 1004.5246 1028.6234 1048.7683 1077.4772 1084.2637 1105.0030 1118.7465 1145.9577 1151.6116 1161.4017 1188.7623 1205.9882 1223.7362 1252.4774 1257.6016 1274.1008 1292.8638 1310.9044 1324.5499 1333.2725 1342.1630 1349.7534 1359.4676 1368.4903 1390.0537 1391.6767 1454.8040 1459.9232 1462.3623 1468.4160 1469.9838 1480.0216 1481.3401 1580.0034 1624.9510 2126.6900 2943.8652 2970.7372 2972.9789 2974.0137 2976.6867 2986.5527 2992.1936 2996.9028 3030.6345 3051.6917 3061.4166 3067.0625 3075.4715 3081.0421 3087.0827 3099.2849 3140.2805 3424.5149
redmass: 5.8491 4.2294 3.9331 2.8259 1.7811 1.8808 2.0295 1.1716 3.0015 2.7072 3.2707 3.2965 2.8663 2.5414 2.7803 2.8538 3.5938 3.2449 3.2847 3.0963 4.7247 4.3560 1.3393 1.5056 2.2670 3.6907 2.4696 2.9802 2.1132 3.3617 1.8461 2.3728 2.1486 1.9269 1.8998 1.9000 1.7172 1.8070 1.3545 1.6969 1.9664 1.8765 2.2441 1.9771 1.7630 1.9851 2.0106 1.6916 1.5348 1.5709 1.6318 1.5873 1.3678 1.7950 1.3685 1.7171 1.4511 1.3701 1.6235 1.4201 1.5222 1.4300 1.5818 1.2298 1.2582 1.0792 1.0794 1.0684 1.0634 1.0596 1.0632 1.0596 9.5128 7.3338 6.0627 1.0795 1.0744 1.0461 1.0723 1.0606 1.0660 1.0369 1.0679 1.0997 1.1014 1.0998 1.0991 1.0882 1.0992 1.0995 1.0987 1.0958 1.1578
irintensity: 3.7279 0.4184 0.4785 0.2890 0.2687 0.7662 0.7943 0.5131 1.0902 0.8929 2.0661 4.7737 0.7437 2.0775 1.1076 0.2032 6.9337 0.2221 3.6664 1.7547 1.6892 1.8129 69.7915 53.5336 25.5917 1.8680 0.5943 0.9991 6.6152 2.8998 25.3494 16.4416 0.8555 1.4195 13.1634 1.1204 4.4711 10.5343 2.7690 0.7281 0.5043 9.7776 4.1346 15.8205 1.6908 8.6765 5.0544 8.8367 1.3730 3.1134 1.4676 26.4754 0.8958 5.4549 0.0755 7.9449 1.6376 2.5352 4.5701 2.3750 3.2166 3.0221 8.6733 17.8110 19.3791 4.8984 12.0484 16.8115 3.3097 10.7170 11.0402 3.1671 129.2511 77.2013 9.0430 16.6791 3.6524 2.3328 28.7160 55.4494 22.7427 25.3034 46.1491 30.7823 41.9102 24.9292 27.1491 23.5642 35.9882 21.1485 25.5937 16.2922 66.3208
temp: 298.150 k
press: 1.00000 atm
elementType: 8 6 6 6 6 6 6 6 6 6 6 6 6 6 6 1 1 1 1 1 1 1 1 1 1 1 1 1 1 1 1 1 1
symmnumber: 1
zpe: 734616.8 jmol-1
zpe.correction: 0.279801 hartree
zpe.thermalcorrener: 0.294465 hartree
zpe.thermalcorrenthalpy: 0.295409 hartree
zpe.thermalcorrgfe: 0.239486 hartree
zpe.sumelectzpe: -618.309454 hartree
zpe.sumelectthermal: -618.294790 hartree
zpe.sumelectthermalent: -618.293845 hartree
zpe.sumelectthermalfe: -618.349769 hartree
dipole: 2.9983 2.1415 1.1622
dipole: 3.8635
quadrupole: -106.2931 -87.3763 -87.2882
quadrupole: -4.2273 -3.4051 -3.2596
quadrupole: -12.6406 6.2762 6.3643 -4.2273 -3.4051 -3.2596
hfenergy: -618.5892548 hartree
pointgroup: C01 [X(C14H18O1)]
dipole: 1.1072967 -0.9334838 -0.4614097 debye
polarizability: 163.237642|-7.2129916|139.3781549|-17.9108149|-4.0040005|123.0145793 unknown
InChI: InChI=1S/C14H18O/c1-4-11-5-7-14(3)8-6-13(15)10(2)12(14)9-11/h1,6,8,10-12H,5,7,9H2,2-3H3
charge 0 multiplicity 1
33 atoms
O  -3.437536 1.008857 0.81685
C  -0.030644 -1.185837 -0.54414
C  -0.049301 0.385994 -0.508852
C  0.578373 0.961475 0.789105
C  1.379928 -1.731522 -0.155763
C  -1.502273 0.929235 -0.705555
C  2.000315 0.40273 1.090325
C  1.930232 -1.15131 1.160632
C  -1.091428 -1.73757 0.400162
C  -0.349804 -1.720425 -1.977839
C  -2.453701 0.351445 0.359644
C  -1.60261 2.465779 -0.795718
C  -2.195105 -1.041482 0.802867
C  2.997935 0.862464 0.09824
C  3.837428 1.252078 -0.718683
H  0.563098 0.743988 -1.362631
H  -0.065507 0.724298 1.658643
H  0.627301 2.061671 0.710847
H  2.087132 -1.488196 -0.973282
H  1.33419 -2.837316 -0.092186
H  -1.871046 0.518648 -1.671609
H  2.316657 0.787334 2.081596
H  1.270688 -1.426148 2.007892
H  2.93152 -1.570301 1.370403
H  -0.952455 -2.775893 0.740464
H  0.379503 -1.312311 -2.70259
H  -0.273978 -2.823544 -2.004876
H  -1.366023 -1.451159 -2.314054
H  -0.898662 2.855013 -1.554216
H  -2.626057 2.768474 -1.072987
H  -1.379857 2.947949 0.171455
H  -2.940576 -1.478571 1.478406
H  4.570464 1.596356 -1.424945
