program: Gaussian 09
title: 000193436
version: EM64L-G09RevD.01
frameworkgroup: C1[X(C8H9NO5S)]
method: RPBEPBE
basis: SDD
operation: Freq
keyword: #p
keyword: freq=noraman
keyword: PBEPBE/SDD
title: #p freq=noraman PBEPBE/SDD
converged: YES YES NO NO
title: Mulliken charges:
elementType: S O O O O O N C C C C C C C C H H H H H H H H H
charge: 0.947982 -0.246616 -0.540833 -0.543465 -0.412983 -0.195026 -0.717645 -0.063044 -0.234480 -0.202019 0.400606 -0.311360 -0.348647 -0.398881 0.193327 0.282732 0.284704 0.245646 0.266614 0.286307 0.249237 0.333185 0.334305 0.390353
chargesum: 0.00000
title: Mulliken charges with hydrogens summed into heavy atoms:
elementType: S O O O O O N C C C C C C C C
charge: 0.947982 -0.246616 -0.540833 -0.543465 -0.022630 -0.195026 -0.050155 -0.063044 0.048252 0.082685 0.400606 -0.065714 -0.082034 0.136664 0.193327
polarizability: 1.91223331e+02 -1.33848782e+00 1.24050628e+02 8.33959520e+00 -8.37399835e+00 9.34614609e+01
1716.lowfreq: -1.1568 -0.0014 0.0008 0.0018 6.6422 10.4929 18.6958 26.9668 39.7329
frequency: 18.5538 26.8964 39.7142 59.4779 83.1845 109.1122 126.3960 167.4187 209.1664 241.9618 247.9719 268.6614 295.3796 330.4910 367.3085 374.9438 415.1789 423.1042 471.2114 486.3467 508.6178 527.9731 585.7155 607.2304 626.4687 634.1974 721.5204 762.8182 794.5949 812.6834 813.6504 830.9181 844.3506 907.0748 953.1164 972.5854 986.5645 1002.9926 1011.7175 1052.5123 1056.2394 1070.8755 1118.7909 1175.3256 1210.1650 1239.0812 1266.5068 1290.0437 1358.4077 1391.4025 1411.5056 1446.8395 1470.0440 1532.8131 1589.9387 1604.5572 1692.1176 3002.6009 3091.2805 3154.3790 3159.9658 3172.5018 3181.6339 3362.2879 3520.8778 3529.8022
redmass: 6.1346 7.2966 6.5916 4.5097 6.9389 1.5685 5.6634 6.2804 5.5761 4.6264 9.0652 2.5978 10.1977 5.8405 6.0675 6.1867 2.9371 9.4370 3.9599 1.8348 4.1867 2.8835 4.9516 6.4812 1.5939 4.8211 3.4169 5.1697 3.1813 2.4972 1.3362 3.9236 1.6312 4.1023 1.3655 1.3582 4.5936 3.4466 2.6616 3.3974 2.2461 1.4820 1.2836 1.1940 1.9131 1.4163 1.8711 1.2592 1.5356 5.9726 4.1563 1.0881 2.3412 1.0856 6.5393 7.4570 9.1546 1.0642 1.0973 1.0883 1.0893 1.0964 1.0971 1.0414 1.0644 1.0999
irintensity: 0.6725 0.5711 1.5128 1.2602 2.6819 39.7775 0.6020 2.6353 9.6800 2.7679 2.5155 1.6763 0.2873 10.0204 6.6850 11.2828 0.2943 75.9391 133.9222 23.2744 49.1003 95.7726 19.5784 3.4553 115.8606 31.6578 0.2572 9.0130 24.0843 228.6138 11.6074 23.5009 54.9637 60.4116 0.9736 0.4674 0.2642 196.7320 157.2080 105.6261 10.4465 29.9535 8.0639 75.2561 106.9545 108.3615 10.2646 3.5417 20.5897 9.1883 5.4381 35.0193 109.2093 20.3078 70.2930 40.0781 202.9746 23.8894 5.8066 3.3363 0.6729 11.4347 4.9986 25.7230 37.1875 23.6449
temp: 298.150 k
press: 1.00000 atm
elementType: 16 8 8 8 8 8 7 6 6 6 6 6 6 6 6 1 1 1 1 1 1 1 1 1
symmnumber: 1
zpe: 435558.9 jmol-1
zpe.correction: 0.165896 hartree
zpe.thermalcorrener: 0.181589 hartree
zpe.thermalcorrenthalpy: 0.182533 hartree
zpe.thermalcorrgfe: 0.120190 hartree
zpe.sumelectzpe: -1137.869330 hartree
zpe.sumelectthermal: -1137.853637 hartree
zpe.sumelectthermalent: -1137.852692 hartree
zpe.sumelectthermalfe: -1137.915036 hartree
dipole: 4.4659 0.3236 4.4961
dipole: 6.3454
quadrupole: -80.7224 -92.2961 -101.8661
quadrupole: -10.5112 -10.1592 -2.5433
quadrupole: 10.9058 -0.6679 -10.2379 -10.5112 -10.1592 -2.5433
hfenergy: -1138.0352256 hartree
pointgroup: C01 [X(C8H9N1O5S1)]
dipole: -1.716731 0.6821765 1.6792423 debye
dipolederiv: 2.338597 0.1470464 0.1454372 0.22195 1.2144896 0.0594695 0.120282 0.0593102 1.5128372 -1.9022128 0.1185184 0.1153063 0.0053533 -0.2792704 0.0398977 0.2938003 -0.0062621 -0.3208276 -0.8081919 0.0519662 0.0466343 0.0390336 -0.6136912 -0.1795096 -0.0050538 -0.0085399 -0.5303508 -0.7587265 -0.0780437 -0.008431 -0.103542 -0.618465 0.1944483 0.0040834 0.014234 -0.5614341 -1.0524928 0.4233151 0.0902603 0.5997393 -0.8263107 -0.081737 -0.0754015 -0.0060899 -0.2600873 -0.6127023 0.2043424 0.0070681 0.2431278 -0.4451952 -0.0413174 0.1172936 -0.2296767 -0.8003385 -0.778077 -0.0659165 -0.100956 -0.0924381 -0.3790045 -0.0635747 -0.1867817 -0.0739487 -0.8482205 -0.2522924 0.0521439 0.0322009 0.0059819 -0.220612 0.0049538 0.1541262 0.0111065 -0.2133326 0.0922648 -0.0120895 -0.0383205 -0.2477608 0.0053303 0.0272536 -0.0153953 -0.0321647 -0.0653038 -0.0030175 -0.0533688 -0.0181857 0.257826 0.0665394 -0.0530974 -0.0709164 0.0095921 -0.0701409 1.7490762 0.0192758 -0.1692819 0.3611047 0.1178489 -0.0318024 -0.2949203 -0.0088107 0.1767918 -0.3735743 -0.0680908 0.0425057 -0.3640127 -0.0686492 0.0081696 0.0965425 -0.0268612 -0.1734363 -0.4749437 0.0496095 0.0166801 0.182794 0.046303 -0.0481677 0.0247001 -0.0227879 -0.1502004 0.8412061 -0.1253349 0.0350397 -0.484787 0.3267597 0.0742696 -0.1199817 0.0841006 -0.0073876 1.1100753 -0.6914852 -0.069044 -0.8056156 0.827681 0.0689342 0.0422999 0.1689432 1.0389666 0.1343971 -0.0456429 0.0151632 -0.0214389 0.052372 0.0140832 0.0067534 0.0294907 0.1449657 0.0969897 0.0755219 0.0040816 0.0428379 0.0831087 0.0074067 0.0048893 -0.0107024 0.1515336 -0.0307463 0.0856666 0.0207097 0.111873 0.0114204 0.0171919 0.0234134 0.0133767 0.153982 0.0542273 -0.0529948 0.0278348 -0.0486475 0.0035319 0.0285357 0.0363135 0.0286685 0.1627174 -0.0642962 -0.0051976 0.0366683 -0.0180429 0.0911083 0.0454251 0.0247965 0.02222 0.0997444 0.0418144 -0.0363205 -0.0785507 0.1007515 -0.0541084 -0.0842022 -0.0471857 -0.0360195 0.0569514 0.1262142 0.0538973 -0.0620233 0.0050469 0.1419088 -0.1041564 -0.0391903 -0.0649302 0.2142702 0.1451789 -0.0687211 -0.0810324 -0.0156352 0.1498065 0.0921432 -0.0554997 0.0611691 0.1838485 0.3812326 0.0219026 -0.0097647 0.024501 0.3670982 0.0053827 -0.0389676 0.0245821 0.1044517 unknown
polarizability: 190.5115521|-7.9549164|125.928265|-7.8198887|-5.1465225|92.2956026 unknown
InChI: InChI=1S/C8H9NO5S/c9-15(12,13)7-3-1-6(2-4-7)14-5-8(10)11/h1-4,10H,5,9H2
charge 0 multiplicity 1
24 atoms
S  3.54707 0.16013 -0.426761
O  -2.277164 -0.930676 0.764407
O  4.183327 -1.23432 -0.979789
O  3.666049 1.582898 -1.213223
O  -4.731472 1.571468 -0.358557
O  -3.356221 0.196929 -1.649488
N  4.289654 0.441983 1.239939
C  1.736322 -0.142026 -0.060255
C  0.866337 0.956943 -0.068595
C  1.312459 -1.461817 0.179537
C  -0.951172 -0.5850 0.458069
C  -0.502261 0.733012 0.192865
C  -0.050666 -1.680037 0.442426
C  -3.279871 0.115214 0.841275
C  -3.745575 0.59204 -0.537839
H  1.242813 1.957787 -0.302227
H  2.024885 -2.291306 0.137615
H  -1.190299 1.582342 0.167307
H  -0.439771 -2.683778 0.633064
H  -4.139654 -0.340338 1.359532
H  -2.941892 0.983551 1.4395
H  4.981491 -0.30809 1.407012
H  4.710328 1.386632 1.2374
H  -5.072619 1.876958 -1.242413
