program: Gaussian 09
title: 000193405
version: EM64L-G09RevD.01
frameworkgroup: C1[X(C18H35NO2)]
method: RPBEPBE
basis: SDD
operation: Freq
keyword: #p
keyword: freq=noraman
keyword: PBEPBE/SDD
title: #p freq=noraman PBEPBE/SDD
converged: YES YES NO NO
title: Mulliken charges:
elementType: O O N C C C C C C C C C C C C C C C C C C H H H H H H H H H H H H H H H H H H H H H H H H H H H H H H H H H H H
charge: -0.438810 -0.212336 -0.303545 -0.070647 -0.439812 -0.121296 -0.074747 -0.457883 -0.465132 -0.367802 -0.385410 -0.723263 -0.388317 -0.386945 -0.384582 -0.386284 -0.371305 -0.371454 -0.499006 0.217721 -0.771749 0.207711 0.183559 0.213011 0.202142 0.213648 0.195190 0.236516 0.187373 0.204523 0.228796 0.188526 0.227245 0.192254 0.190018 0.230632 0.222559 0.209580 0.194465 0.195393 0.195370 0.192503 0.314961 0.191602 0.194023 0.194431 0.197494 0.188580 0.188653 0.224412 0.209455 0.234485 0.227855 0.239335 0.255319 0.230983
chargesum: 0.00000
title: Mulliken charges with hydrogens summed into heavy atoms:
elementType: O O N C C C C C C C C C C C C C C C C C C
charge: -0.123849 -0.212336 -0.074749 0.137065 -0.043241 0.080846 0.138901 -0.026177 -0.073236 0.047968 -0.003138 -0.060492 0.001542 0.000928 0.001042 0.005641 0.005928 0.062413 -0.036666 0.217721 -0.046111
polarizability: 2.62977385e+02 8.11787462e-01 1.91129100e+02 2.66717164e+00 -6.03080345e+00 1.68797828e+02
1716.lowfreq: -14.1916 -3.1044 -0.0017 0.0007 0.0016 2.7650 12.1577 13.5848 21.9036
frequency: 6.3760 11.9417 21.7510 29.3961 31.5932 49.1203 55.8365 72.3028 81.9045 92.4161 101.0637 111.6205 117.9307 128.9208 131.9428 145.2862 150.9284 153.2120 182.5150 197.0851 212.7584 226.6877 241.7807 249.7511 273.1903 315.3088 353.0148 369.8132 389.5703 422.0011 431.9357 456.7066 466.4289 469.4455 496.6987 523.9453 570.2539 576.0322 582.7638 695.3512 711.8674 717.8273 724.4422 740.2652 759.9075 773.3138 809.8615 821.6141 847.2983 860.2034 867.3570 896.1727 922.4394 938.1532 942.0262 953.1626 969.5373 984.2672 989.4059 1004.0854 1019.6798 1020.9874 1037.6607 1042.5262 1054.0436 1072.6888 1074.6108 1079.5583 1082.2787 1085.4311 1087.2940 1097.1516 1122.9336 1123.7185 1132.5886 1139.8572 1165.8566 1187.0402 1195.9312 1203.7701 1208.0528 1217.8845 1230.1291 1236.1828 1249.8839 1258.7922 1269.9955 1274.1316 1279.1954 1282.0877 1284.0696 1292.0484 1293.2417 1296.7447 1301.9076 1305.2755 1316.8449 1320.6723 1335.4384 1343.4961 1345.6440 1352.8823 1354.1525 1356.7203 1357.6635 1359.3053 1365.8869 1368.0353 1385.0335 1425.3579 1427.4907 1443.4845 1454.1817 1456.1920 1457.2611 1458.3927 1459.4295 1462.1431 1463.2261 1465.7331 1468.3958 1470.5289 1477.3819 1478.4584 1484.1807 1487.7317 1635.8626 2934.9080 2938.4608 2945.9105 2946.5799 2948.8532 2949.9546 2950.4228 2953.0949 2956.5471 2958.3607 2962.8888 2968.0328 2977.3896 2979.1672 2981.4746 2984.9627 2985.0621 2989.5493 2992.1371 2996.3747 3002.0228 3005.7943 3020.3860 3022.6945 3036.2876 3044.8370 3046.8546 3048.2534 3056.4596 3066.0507 3079.3398 3093.7173 3118.5558 3397.5393 3530.2416
redmass: 2.6313 4.3654 4.3603 3.8466 2.3214 4.3362 3.4762 1.6486 3.6703 2.0382 1.4287 1.7821 2.8572 4.5445 2.4389 1.9170 2.1250 2.0864 3.1376 1.3394 1.1117 2.4688 2.8754 3.3258 3.8134 3.1512 2.6076 3.5303 2.7205 2.7998 3.2734 2.1840 2.9038 2.2274 2.6022 3.5097 2.1750 1.9512 3.9307 2.3991 1.1049 1.0647 1.0963 1.1649 1.9664 1.3608 1.5291 2.5087 2.0653 2.3064 1.5824 1.7684 1.5231 2.1195 2.0084 1.7106 1.3996 3.8260 3.4240 1.5366 1.9515 2.1683 1.5975 2.4575 2.4166 2.3295 2.4244 2.0536 2.1247 1.6175 2.1404 2.9075 1.9960 2.2559 2.2566 1.4851 1.9798 1.8221 1.3908 1.6826 1.3869 1.4917 1.5817 1.4233 1.3727 1.3560 1.2531 1.0356 1.2863 1.1826 1.0991 1.1112 1.1431 1.3133 1.3287 1.3938 1.3507 1.4145 1.4495 1.4750 1.4827 1.7214 1.4741 1.5992 1.4959 1.6735 1.2430 1.1867 1.2464 1.1972 1.0922 1.0667 1.0842 1.0580 1.0876 1.0755 1.0727 1.0631 1.0815 1.0494 1.0838 1.0941 1.0823 1.0783 1.0994 1.0999 7.7787 1.0738 1.0645 1.0591 1.0596 1.0601 1.0592 1.0599 1.0718 1.0599 1.0823 1.0593 1.0633 1.0642 1.0383 1.0958 1.0958 1.0360 1.0787 1.0835 1.0931 1.0963 1.1012 1.0981 1.1016 1.1043 1.0894 1.1017 1.0987 1.1028 1.0950 1.0986 1.1003 1.1005 1.0742 1.0652
irintensity: 4.1358 0.1252 0.4613 0.3569 2.1784 0.4998 0.5550 0.0481 1.2850 0.7788 0.5444 0.3602 1.2780 1.9450 0.0537 1.1641 1.9910 5.5838 13.7456 10.1034 110.5044 7.3414 1.5875 11.3493 1.6145 1.4262 1.6267 3.8712 1.2700 0.5789 3.2517 0.9371 10.2055 2.5594 2.4686 2.6162 10.8142 86.7439 2.1394 19.3654 9.2685 11.5201 2.3671 1.7078 11.4740 5.6084 2.2308 1.1514 14.8083 4.2458 5.7975 7.5738 8.0650 22.7788 26.5009 4.0087 2.5281 0.3382 4.0554 5.1185 3.3310 9.0159 0.5008 7.3756 2.6844 6.4007 7.2507 0.2222 1.4625 15.1464 7.5731 1.5897 8.2798 19.0736 6.9637 17.9228 30.1098 5.5672 64.5982 16.4127 20.7270 6.6856 0.7315 10.9320 2.1639 21.1807 0.6868 0.1401 8.7475 2.3547 0.1939 0.4641 0.2603 5.3420 3.8943 1.6648 5.8094 11.4081 7.3358 8.6205 2.7646 0.5329 3.8794 3.3619 10.1875 6.0059 62.6646 20.2671 22.2476 33.0814 22.0854 21.1935 11.0003 17.1331 4.5473 0.1071 0.4130 0.3156 0.3900 18.0264 3.9973 1.5517 5.5299 2.4434 1.9030 32.4563 105.3391 9.0381 1.9913 1.5515 5.4476 10.7366 1.4937 14.4968 38.3155 0.6109 36.8701 96.5888 145.6041 36.1632 4.6203 0.6183 7.4260 26.2243 26.2657 11.2344 10.6875 9.9981 0.6632 38.2809 24.5243 52.1698 48.4949 161.4164 47.3342 102.6334 20.3146 41.5064 26.8148 15.5975 2.9514 0.5767
temp: 298.150 k
press: 1.00000 atm
elementType: 8 8 7 6 6 6 6 6 6 6 6 6 6 6 6 6 6 6 6 6 6 1 1 1 1 1 1 1 1 1 1 1 1 1 1 1 1 1 1 1 1 1 1 1 1 1 1 1 1 1 1 1 1 1 1 1
symmnumber: 1
zpe: 1313747.3 jmol-1
zpe.correction: 0.500380 hartree
zpe.thermalcorrener: 0.526833 hartree
zpe.thermalcorrenthalpy: 0.527777 hartree
zpe.thermalcorrgfe: 0.437733 hartree
zpe.sumelectzpe: -910.376064 hartree
zpe.sumelectthermal: -910.349611 hartree
zpe.sumelectthermalent: -910.348667 hartree
zpe.sumelectthermalfe: -910.438711 hartree
dipole: 0.2357 1.2228 -2.1084
dipole: 2.4487
quadrupole: -157.5295 -133.5163 -132.2496
quadrupole: 34.1487 -3.5761 1.9667
quadrupole: -16.4311 7.5822 8.8489 34.1487 -3.5761 1.9667
hfenergy: -910.8764439 hartree
pointgroup: C01 [X(C18H35N1O2)]
dipole: -0.0911786 -0.5070855 -0.8140612 debye
polarizability: 262.9946229|0.5917377|191.4880721|-2.4036556|5.3141838|168.421617 unknown
InChI: InChI=1S/C18H35NO2/c1-15(20)11-9-7-5-3-4-6-8-10-12-17-13-14-18(21)16(2)19-17/h16-19,21H,3-14H2,1-2H3
charge 0 multiplicity 1
56 atoms
O  7.710582 -0.584516 1.594544
O  -9.402415 0.893194 0.791415
N  5.052215 -0.728264 0.009251
C  4.910178 0.686964 -0.431086
C  6.110402 1.570336 0.015268
C  6.341772 -1.366792 -0.365125
C  7.571354 -0.53623 0.120935
C  7.464185 0.923454 -0.378928
C  3.557837 1.255037 0.05275
C  2.328123 0.543195 -0.553164
C  0.988248 1.034344 0.038342
C  6.381499 -2.818131 0.137929
C  -0.23809 0.29304 -0.540404
C  -1.582508 0.769812 0.053961
C  -2.800277 -0.018646 -0.478613
C  -4.146267 0.460056 0.110408
C  -5.357735 -0.361783 -0.384751
C  -6.70011 0.129472 0.200324
C  -7.897419 -0.715655 -0.272563
C  -9.258934 -0.224409 0.227775
C  -10.441285 -1.167512 0.017671
H  4.907215 0.668762 -1.543436
H  6.059047 1.725483 1.115715
H  6.032017 2.576974 -0.440206
H  6.382514 -1.3697 -1.475786
H  8.505885 -1.00381 -0.236796
H  7.561175 0.927576 -1.484016
H  8.308849 1.510258 0.026544
H  3.516882 1.183104 1.16259
H  3.521047 2.337115 -0.186998
H  4.8384 -0.84568 1.01221
H  2.324352 0.697755 -1.652461
H  2.435439 -0.547263 -0.39473
H  0.877936 2.124976 -0.140473
H  1.00449 0.901709 1.140983
H  5.490562 -3.366844 -0.213158
H  6.412219 -2.847258 1.242733
H  7.285178 -3.336647 -0.230002
H  -0.1230 -0.795819 -0.356556
H  -0.257707 0.420229 -1.643066
H  -1.718912 1.849784 -0.164206
H  -1.545556 0.679337 1.15998
H  6.934712 -0.109478 1.990708
H  -2.663459 -1.096647 -0.249866
H  -2.834351 0.061447 -1.585453
H  -4.099489 0.409469 1.218351
H  -4.29981 1.529345 -0.144465
H  -5.204003 -1.429622 -0.120746
H  -5.399477 -0.319171 -1.493798
H  -6.872077 1.186821 -0.076395
H  -6.65651 0.111329 1.307027
H  -7.942948 -0.727622 -1.384129
H  -7.777202 -1.779873 0.020385
H  -10.422993 -1.953534 0.798385
H  -11.391151 -0.616721 0.10371
H  -10.385127 -1.679346 -0.960018
