program: Gaussian 09
title: 000193404
version: EM64L-G09RevD.01
frameworkgroup: C1[X(C18H30O2)]
method: RPBEPBE
basis: SDD
operation: Freq
keyword: #pfreq=noraman
keyword: PBEPBE/SDD
title: #p freq=noraman PBEPBE/SDD
converged: YES YES NO NO
title: Mulliken charges:
elementType: O O C C C C C C C C C C C C C C C C C C H H H H H H H H H H H H H H H H H H H H H H H H H H H H H H
charge: -0.425899 -0.261141 -0.371301 -0.386287 -0.402128 -0.392511 -0.485370 -0.489022 -0.338884 -0.367538 -0.357735 -0.465280 -0.190180 -0.693740 0.209554 -0.177124 -0.187731 -0.257348 -0.271593 -0.272418 0.227850 0.189864 0.228966 0.190642 0.199308 0.198764 0.199528 0.220918 0.202309 0.217283 0.235033 0.249131 0.185944 0.188472 0.208502 0.194342 0.196772 0.195676 0.206394 0.201449 0.221614 0.209750 0.209866 0.216367 0.228396 0.241098 0.229067 0.230154 0.263155 0.397061
chargesum: 0.00000
title: Mulliken charges with hydrogens summed into heavy atoms:
elementType: O O C C C C C C C C C C C C C C C C C C
charge: -0.028838 -0.261141 0.046412 0.033322 -0.004056 0.027935 -0.065778 -0.004858 0.035532 0.035306 0.034713 -0.057436 0.031433 -0.057757 0.209554 0.051272 0.053367 -0.028281 -0.041440 -0.009262
polarizability: 3.74822108e+02 5.14370825e+01 1.86852559e+02 -3.29647393e+00 -7.96768944e+00 1.59808677e+02
1716.lowfreq: -0.0010 -0.0007 0.0019 2.2719 4.0952 14.9718 17.3586 25.5479 32.1920
frequency: 17.2935 25.4853 32.0193 41.8359 50.0992 57.4812 61.7710 77.4615 92.1303 103.6811 115.7698 122.7724 143.5737 154.4186 169.6692 173.1539 193.6089 200.9894 228.1508 233.8124 243.9288 272.6744 284.0910 298.4291 349.0776 359.0741 370.7372 394.8433 420.5495 467.3281 474.9925 510.8921 535.3233 542.9596 565.5808 615.1944 689.6488 719.7060 724.0185 749.8754 767.4314 789.7148 812.4933 832.0743 834.1355 846.7872 868.5169 889.6387 900.3114 918.0250 923.5160 930.9690 948.1206 969.1275 972.6256 996.8405 1016.1839 1019.2050 1024.5792 1048.2817 1055.8767 1074.4274 1076.3515 1081.9165 1102.6729 1108.1884 1114.6913 1119.5647 1147.4582 1149.7109 1168.0496 1184.4491 1191.5681 1201.4678 1221.6995 1228.0430 1236.6491 1250.7379 1269.7475 1271.8488 1277.0098 1278.1057 1282.3334 1287.8794 1289.5708 1294.1411 1296.8311 1303.3304 1313.4359 1327.2595 1335.5914 1341.8405 1347.7510 1351.6724 1360.6585 1364.7125 1370.6479 1388.8653 1449.4271 1457.0214 1459.1438 1462.2693 1463.7889 1469.0187 1469.9832 1473.3285 1476.9067 1479.4149 1481.7943 1487.4263 1592.2583 1638.3615 1646.7337 1657.7496 2946.2082 2952.8237 2956.9719 2963.1944 2965.1339 2971.6172 2972.3719 2973.5034 2975.3433 2985.1731 2992.2668 3002.4612 3008.1685 3011.3970 3021.9685 3022.6312 3039.8360 3041.7182 3043.2082 3054.3548 3069.0699 3069.4876 3070.2776 3071.6190 3075.4071 3078.3880 3082.9131 3088.9095 3095.3120 3368.3759
redmass: 4.5519 4.3871 4.5541 1.6202 5.6250 4.8393 3.8119 4.4944 3.1100 2.6805 3.2846 2.4358 2.1364 3.0120 2.7764 2.4903 3.1531 3.7224 1.1559 2.3752 2.3765 2.2334 2.4172 2.2176 2.5144 3.3907 2.8164 2.8528 2.8272 3.2783 2.8714 2.7368 2.9557 2.9230 2.9921 2.2138 1.3639 1.3523 1.0689 1.1406 1.6320 1.6544 1.5379 2.6764 1.6584 1.6160 2.0886 1.8742 2.0622 2.0655 1.9131 1.1840 1.3188 1.6356 1.1881 3.7845 1.8805 1.1505 2.0226 2.2345 1.8431 2.0198 2.3239 2.6766 2.0871 1.9386 2.0842 2.0637 1.3575 1.6295 2.5707 1.6715 1.4041 1.4768 1.3207 1.3484 1.2886 1.2539 1.3007 1.3146 1.3315 1.3071 1.2904 1.1311 1.3060 1.2410 1.2760 1.2576 1.2734 1.2538 1.3909 1.3674 1.4126 1.6295 1.5056 1.6125 1.5253 1.2150 1.0911 1.0903 1.0825 1.0926 1.0701 1.0844 1.0760 1.0958 1.0428 1.0742 1.0922 1.0863 5.6578 5.4564 7.6682 6.0115 1.0623 1.0588 1.0606 1.0622 1.0596 1.0560 1.0401 1.0637 1.0629 1.0622 1.0974 1.0658 1.0967 1.0988 1.1022 1.0969 1.0996 1.0960 1.1039 1.1011 1.1003 1.0923 1.0930 1.0993 1.0919 1.0882 1.0961 1.0886 1.0868 1.0648
irintensity: 0.1437 0.1606 0.0637 0.0732 0.3399 1.2703 0.1599 0.8568 2.4518 0.4338 2.4583 0.0796 0.2635 1.0831 0.1808 0.5500 1.8957 0.1798 0.0013 0.0191 0.4962 1.3986 0.7233 1.2484 0.3121 0.5675 0.9952 1.9656 5.3730 0.6607 2.3458 2.5069 12.5585 2.7234 1.8105 44.2174 106.7633 20.5888 12.6742 1.3031 13.2706 2.1952 7.1133 2.4242 8.3138 1.5757 1.4393 3.8425 0.7076 16.6245 2.5199 2.2434 7.4001 8.8117 2.0330 4.3502 43.6116 147.1645 12.1429 10.9545 26.1793 89.3353 0.5958 1.3776 48.7307 16.7263 2.1838 35.0347 3.0974 20.6248 3.6193 3.0532 5.0216 0.3345 0.5377 2.8152 0.4266 0.7828 3.8068 11.1647 1.4984 1.8771 0.5266 0.6204 5.6201 1.7839 2.5774 0.4484 2.6373 0.6283 1.3861 6.1745 3.0343 0.9902 2.9801 20.8677 17.0050 10.6665 24.1878 5.8552 8.3412 16.9476 0.5609 2.6094 2.2597 18.7992 12.5376 3.6200 13.0254 20.7967 0.8669 3.8034 138.4871 36.3657 26.1850 14.9665 9.1297 42.5147 2.9801 116.5963 36.5518 67.6829 64.1923 44.6602 2.7154 20.8565 6.0481 12.7596 2.9180 19.1881 36.6137 43.2312 74.2581 81.5260 75.3943 31.6252 15.5168 57.4795 7.7995 18.6890 21.5913 12.5024 82.4786 249.7088
temp: 298.150 k
press: 1.00000 atm
elementType: 8 8 6 6 6 6 6 6 6 6 6 6 6 6 6 6 6 6 6 6 1 1 1 1 1 1 1 1 1 1 1 1 1 1 1 1 1 1 1 1 1 1 1 1 1 1 1 1 1 1
symmnumber: 1
zpe: 1150772.7 jmol-1
zpe.correction: 0.438306 hartree
zpe.thermalcorrener: 0.462491 hartree
zpe.thermalcorrenthalpy: 0.463435 hartree
zpe.thermalcorrgfe: 0.381399 hartree
zpe.sumelectzpe: -852.746018 hartree
zpe.sumelectthermal: -852.721833 hartree
zpe.sumelectthermalent: -852.720889 hartree
zpe.sumelectthermalfe: -852.802925 hartree
dipole: 0.1852 0.5356 -1.2986
dipole: 1.4168
quadrupole: -106.8667 -123.4894 -127.4496
quadrupole: 1.9945 -1.9857 -1.4517
quadrupole: 12.4018 -4.2208 -8.1810 1.9945 -1.9857 -1.4517
hfenergy: -853.1843242 hartree
pointgroup: C01 [X(C18H30O2)]
dipole: -0.0634843 0.2186978 0.5087848 debye
polarizability: 371.1759376|-57.553235|190.6481007|-3.3626374|7.9943776|159.6593062 unknown
InChI: InChI=1S/C18H30O2/c1-2-3-4-5-6-7-8-9-10-11-12-13-14-15-16-17-18(19)20/h6-11,19H,2-5,12-17H2,1H3
charge 0 multiplicity 1
50 atoms
O  -1.613945 -1.380112 1.108515
O  -2.098932 -1.683456 -1.142112
C  -5.047006 0.532759 0.697514
C  -5.057881 -0.349649 -0.572862
C  -5.181873 2.048223 0.404286
C  -4.973551 -1.873806 -0.304148
C  -4.032578 2.644229 -0.469359
C  -3.771682 -2.311196 0.575441
C  6.819123 -0.417276 0.308796
C  5.446785 -0.154357 -0.351269
C  8.013497 -0.02393 -0.590201
C  4.255567 -0.55204 0.565266
C  -2.666295 2.477375 0.153269
C  9.380384 -0.273499 0.083779
C  -2.443359 -1.781711 0.060653
C  2.910337 -0.330991 -0.08295
C  -1.648139 1.728948 -0.377791
C  1.928043 0.492458 0.402079
C  -0.355441 1.525904 0.259862
C  0.637691 0.705701 -0.240421
H  -4.108041 0.364645 1.26022
H  -5.877665 0.224121 1.366048
H  -4.213491 -0.068348 -1.229552
H  -5.983218 -0.145328 -1.149858
H  -5.218775 2.599414 1.366159
H  -6.145281 2.244308 -0.109477
H  -5.897814 -2.219323 0.200521
H  -4.917191 -2.39974 -1.275679
H  -4.246533 3.724138 -0.613304
H  -4.043618 2.18261 -1.474173
H  -3.713523 -3.417872 0.584388
H  -3.891821 -1.98794 1.622123
H  6.89969 -1.492201 0.575427
H  6.880395 0.144981 1.264155
H  5.357883 0.918189 -0.615931
H  5.380661 -0.719366 -1.303966
H  7.925173 1.047009 -0.864811
H  7.95816 -0.593676 -1.540233
H  4.315198 0.016107 1.514567
H  4.371192 -1.625804 0.82883
H  -2.507925 2.973551 1.1254
H  9.472585 0.310249 1.019167
H  9.506027 -1.342028 0.342209
H  10.217528 0.01455 -0.578409
H  2.727262 -0.871895 -1.026007
H  -1.80989 1.213856 -1.337015
H  2.111414 1.036181 1.342333
H  -0.178882 2.050636 1.212167
H  0.457147 0.18272 -1.192803
H  -0.796494 -0.919218 0.75456
