program: Gaussian 09
title: 000193394
version: EM64L-G09RevD.01
frameworkgroup: C1[X(C7H14O5)]
method: RPBEPBE
basis: SDD
operation: Freq
keyword: #pfreq=noraman
keyword: PBEPBE/SDD
title: #p freq=noraman PBEPBE/SDD
converged: NO YES NO NO
title: Mulliken charges:
elementType: O O O O O C C C C C C C H H H H H H H H H H H H H H
charge: -0.312906 -0.479443 -0.492203 -0.469623 -0.221049 -0.062273 -0.054226 -0.077025 -0.145260 -0.723323 -0.105471 -0.512308 0.232960 0.245682 0.216065 0.247118 0.197604 0.271264 0.234086 0.370052 0.237375 0.351179 0.362120 0.270490 0.222080 0.197036
chargesum: 0.00000
title: Mulliken charges with hydrogens summed into heavy atoms:
elementType: O O O O O C C C C C C C
charge: -0.312906 -0.109391 -0.141023 -0.107503 -0.221049 0.170687 0.191456 0.139040 0.101858 -0.020369 0.131903 0.177297
polarizability: 9.55370342e+01 2.57884120e+00 1.04646899e+02 -3.48810830e+00 1.63916135e+00 7.94064100e+01
1716.lowfreq: -13.9562 -3.6575 -0.0006 0.0004 0.0007 12.9724 36.4630 72.3216 85.1648
frequency: 36.4291 72.2859 85.1454 106.5805 119.6980 156.3848 178.7008 191.7319 219.7668 236.8054 268.2413 275.9942 295.1966 305.9601 327.7397 353.3583 399.2847 442.4123 461.3486 486.9405 550.3724 603.8877 655.2196 702.2528 809.3553 811.3378 879.5177 892.0208 938.2338 971.0816 1002.8043 1037.2539 1059.2494 1068.9611 1076.5061 1096.9657 1114.6730 1117.6540 1156.3885 1185.3590 1205.1722 1239.8229 1264.6109 1300.9932 1303.4547 1313.0884 1317.7299 1324.1815 1362.8479 1375.9702 1383.8518 1402.0730 1429.7179 1451.2150 1461.5357 1485.9076 1488.7417 1603.4641 2948.2681 2952.2061 2953.2157 2979.8153 2990.5566 3009.5727 3020.6486 3068.7437 3071.3688 3103.6607 3118.2619 3392.9255 3467.3974 3590.1193
redmass: 6.2843 4.5110 2.5490 3.4097 3.3077 4.4442 1.5939 2.7700 3.0597 1.2824 1.3554 3.6586 3.2875 3.5506 4.0846 4.0520 3.5437 3.2225 3.4881 1.2272 1.1524 2.6154 2.9291 4.4653 3.2458 3.6244 3.0162 5.3318 1.8645 2.6283 2.0534 2.8126 2.3970 2.6654 2.6353 2.2786 2.4566 1.3052 1.3640 1.3081 1.2921 1.2313 1.2607 1.1732 1.3592 1.3103 1.2174 1.2144 1.4817 1.4490 1.2907 1.5927 1.1369 1.0542 1.0505 1.0556 1.0534 7.9501 1.0824 1.0739 1.0452 1.0380 1.0852 1.0906 1.0859 1.0915 1.0962 1.1006 1.1053 1.0643 1.0641 1.0665
irintensity: 2.8241 1.7001 1.5116 3.4559 3.6648 7.4946 1.5924 3.3800 5.0394 1.9427 84.3952 19.1737 36.2583 11.9144 14.1839 4.6357 0.5239 26.0815 79.3589 115.5175 149.1889 27.0920 18.9961 9.7787 16.8714 37.8897 24.5099 11.8710 13.8944 39.7127 55.5025 45.9075 104.3806 11.6026 125.6737 24.8366 31.0408 0.5172 3.3884 40.7593 3.5950 25.9431 1.9532 7.0555 3.5674 8.6748 14.0214 63.1695 15.8057 19.8461 48.7347 3.3084 5.1954 8.8014 6.7449 17.9923 12.3183 126.1252 26.9816 48.1213 64.0210 27.2324 34.6718 35.1274 38.7107 41.4847 25.7421 10.4443 15.5031 37.3078 43.5874 5.9676
temp: 298.150 k
press: 1.00000 atm
elementType: 8 8 8 8 8 6 6 6 6 6 6 6 1 1 1 1 1 1 1 1 1 1 1 1 1 1
symmnumber: 1
zpe: 551061.2 jmol-1
zpe.correction: 0.209888 hartree
zpe.thermalcorrener: 0.224325 hartree
zpe.thermalcorrenthalpy: 0.225269 hartree
zpe.thermalcorrgfe: 0.168991 hartree
zpe.sumelectzpe: -650.215242 hartree
zpe.sumelectthermal: -650.200805 hartree
zpe.sumelectthermalent: -650.199861 hartree
zpe.sumelectthermalfe: -650.256139 hartree
dipole: -1.3963 0.4837 1.3447
dipole: 1.9979
quadrupole: -65.4377 -72.4320 -77.5151
quadrupole: 9.1554 0.6290 -0.0718
quadrupole: 6.3572 -0.6371 -5.7202 9.1554 0.6290 -0.0718
hfenergy: -650.4251302 hartree
pointgroup: C01 [X(C7H14O5)]
dipole: -0.4235899 0.4162359 0.5149509 debye
dipolederiv: -0.6688291 -0.3411902 -0.0494149 -0.3160696 -0.9458141 0.0162788 0.0169931 0.0655307 -0.4028135 -0.5400221 0.1435165 0.1030835 0.1324906 -0.8002254 0.1172174 0.107085 0.1310169 -0.4842758 -0.6696671 0.1143634 -0.2833086 0.090337 -0.4750767 -0.0839238 -0.2948654 -0.0620536 -0.6306354 -0.6422878 -0.0034772 0.0210982 -0.0345108 -0.5491908 0.1864025 0.0398125 0.2710697 -0.4958803 -0.3566964 -0.1839545 -0.0039899 0.0290511 -0.8918777 -0.2224043 0.0922073 -0.1704238 -0.478842 0.2178076 -0.2025451 -0.0721607 -0.1563206 0.4416662 -0.0170674 -0.0831945 -0.0089459 0.2548287 0.5837909 0.3168247 0.0214346 0.0392439 0.548353 0.0487312 -0.0283603 -0.1067372 0.2915627 0.5386279 -0.1555603 0.1974805 -0.0593814 0.2595325 0.0339458 0.1652261 -0.0064495 0.4624748 0.4351593 0.1181184 -0.0706192 0.167208 0.098942 -0.3364778 0.0395801 -0.3922743 -0.0010924 -0.0430435 0.0521594 0.0512956 0.0415975 0.016937 -0.0062902 -0.0239072 -0.0157945 -0.2354388 0.2475057 0.1578897 -0.1152625 0.0522494 0.9120848 0.3003849 -0.1774139 0.4358706 0.5751875 0.2362499 0.1093675 0.0306137 0.2654794 0.6702951 0.0406028 0.0641936 0.1106888 0.307752 -0.0160419 0.0675866 0.0666126 0.048945 -0.0709105 -0.0520199 0.0837994 -0.1034685 -0.1188952 0.0029169 -0.0050474 0.0211379 0.009115 -0.013034 -0.0991116 0.039531 -0.0251229 -0.1061777 0.0304835 0.0205638 -0.0013418 0.051389 -0.1655356 -0.0200004 0.0181976 -0.0388261 -0.0083843 -0.1199484 -0.0210982 -0.0126577 -0.0283056 0.0648515 0.0152293 -0.05794 -0.0078748 0.026382 -0.1680901 -0.088019 0.0756706 -0.1089213 0.056967 0.0071218 0.0205245 -0.0002533 0.0661421 0.0672951 0.0269271 -0.1047419 0.0110849 0.0868232 0.0387971 -0.1035407 0.038736 0.0229693 0.1043616 -0.0055319 0.0014952 0.0400234 -0.103623 -0.0680819 -0.0074967 0.0003336 0.0870072 0.2503581 0.0241389 -0.1044796 0.0284625 0.3430185 -0.0688011 -0.1061648 -0.0484344 0.3224947 0.025101 -0.0732222 0.097624 -0.0800853 0.0548453 0.0525201 0.0918728 0.0559461 -0.0114458 0.1173337 -0.07465 0.0853307 -0.099144 0.2769692 0.0998133 0.1511963 0.089809 0.284264 0.315649 -0.0185479 0.002417 -0.0586833 0.2268468 -0.0311578 -0.0277391 -0.1546798 0.3503042 0.0710122 0.14055 -0.0439014 0.0491131 -0.0430143 0.0299855 -0.0488431 0.0244567 0.0628183 -0.1021619 -0.1146199 0.0891414 -0.0648957 0.0249435 0.0159904 0.102706 0.0307442 0.0618314 0.0831362 -0.0045423 -0.0025571 -0.0494722 -0.0247734 0.0023153 -0.0734597 -0.1128637 -0.2021377 unknown
polarizability: 98.4654053|4.8861494|101.8205777|-3.4368334|1.2775954|79.3043607 unknown
InChI: InChI=1S/C7H14O5/c1-4(9)6(11)7(12-2)5(10)3-8/h3-7,9-11H,1-2H3
charge 0 multiplicity 1
26 atoms
O  1.952054 1.065456 -0.182315
O  -0.771946 1.973594 -0.519541
O  -2.736685 0.251713 -0.942007
O  0.391302 -1.822035 1.495304
O  1.180748 -2.887451 -0.845284
C  -0.454126 0.541599 -0.432406
C  0.796137 0.426296 0.462242
C  -1.723079 -0.210378 0.053036
C  1.307741 -1.027471 0.700147
C  -2.163742 0.128886 1.483852
C  1.63048 -1.732932 -0.614549
C  2.111675 2.498903 0.11076
H  -0.200896 0.15979 -1.446473
H  0.589108 0.897521 1.445433
H  -1.577725 -1.301246 -0.057053
H  2.273236 -0.907723 1.239328
H  -3.163261 -0.298754 1.694285
H  -1.458694 -0.311606 2.208698
H  -2.210115 1.222568 1.629009
H  -1.674928 2.009497 -0.941055
H  2.285054 -1.187921 -1.32524
H  -3.636518 -0.036632 -0.65085
H  0.296545 -2.702706 1.028271
H  1.257799 3.073141 -0.284045
H  3.049462 2.79548 -0.385707
H  2.203374 2.66601 1.20436
