program: Gaussian 09
title: 000193390
version: EM64L-G09RevD.01
frameworkgroup: C1[X(C9H12O3)]
method: RPBEPBE
basis: SDD
operation: Freq
keyword: #pfreq=noraman
keyword: PBEPBE/SDD
title: #p freq=noraman PBEPBE/SDD
converged: NO NO NO NO
title: Mulliken charges:
elementType: O O O C C C C C C C C C H H H H H H H H H H H H
charge: -0.437369 -0.437756 -0.437286 0.159295 0.159518 0.159729 0.032454 0.033560 0.032927 -0.874336 -0.874527 -0.874228 0.225031 0.224729 0.296493 0.225071 0.224678 0.296449 0.224805 0.296308 0.224951 0.373174 0.373161 0.373169
chargesum: 0.00000
title: Mulliken charges with hydrogens summed into heavy atoms:
elementType: O O O C C C C C C C C C
charge: -0.064195 -0.064596 -0.064117 0.159295 0.159518 0.159729 0.032454 0.033560 0.032927 -0.128082 -0.128329 -0.128164
polarizability: 1.34467912e+02 -4.17233222e-04 1.34472296e+02 5.24938104e-03 -1.32190237e-03 5.93952345e+01
1716.lowfreq: -0.0009 -0.0008 -0.0003 8.2182 9.2898 13.9737 112.3042 113.9494 136.9245
frequency: 112.2632 113.9296 136.9205 144.6215 157.3686 161.5481 205.7508 271.9441 274.7057 285.5388 286.9338 305.2130 327.1097 333.5386 334.0489 365.6099 367.3200 450.1650 450.2611 542.7934 591.2106 632.4964 632.6423 647.0174 751.8507 839.9936 840.7435 1001.3367 1001.7589 1025.6195 1041.5609 1042.6742 1043.4520 1094.4181 1095.0484 1204.7030 1217.4156 1219.4552 1270.4733 1354.5514 1394.9224 1396.2146 1400.4701 1432.9033 1438.7852 1440.1528 1477.1846 1487.9117 1489.5432 1492.1179 1492.4102 1493.4021 1636.0616 1636.3562 2941.0256 2941.4658 2943.1411 3004.3524 3004.5551 3006.2048 3106.1398 3106.2518 3106.4440 3594.1394 3594.6628 3595.9970
redmass: 2.6082 2.9268 1.1051 1.1516 2.2533 1.1816 5.7475 1.2471 1.2660 2.6828 2.6863 1.1110 3.3263 5.1235 5.1170 3.1492 3.0804 6.5726 6.5852 5.7397 5.5570 6.9707 6.9859 3.0367 5.2751 2.7065 2.7027 1.8961 1.8949 1.4862 1.4653 1.4398 1.4334 4.1121 4.1044 1.5522 1.4114 1.4083 5.2933 7.7584 1.2596 1.2658 1.6679 2.4199 1.9869 2.0050 1.0873 1.6559 1.6349 1.0446 1.0448 1.0445 7.0491 7.0319 1.0418 1.0419 1.0419 1.0982 1.0981 1.0981 1.0916 1.0914 1.0914 1.0653 1.0653 1.0653
irintensity: 0.0106 0.0606 2.0889 0.2192 1.5531 0.1471 3.6358 1.9121 0.6949 0.9252 0.9368 382.7927 0.0158 18.0069 18.0373 0.0826 0.1510 3.9762 4.0030 0.0000 0.0003 0.0002 0.0013 0.0002 5.0431 38.0392 37.4735 51.4663 50.4828 0.0277 3.6987 0.8190 0.3630 226.3991 226.7194 0.3895 108.0767 108.8421 0.0076 0.0142 26.8431 25.8019 0.9600 0.0676 26.3327 26.5106 0.9213 86.0448 84.0924 19.0384 13.2690 14.7741 76.9196 76.8130 74.1050 41.6964 33.0632 0.0054 49.3314 36.3261 0.4744 1.8863 1.7441 41.5757 31.9045 29.3705
temp: 298.150 k
press: 1.00000 atm
elementType: 8 8 8 6 6 6 6 6 6 6 6 6 1 1 1 1 1 1 1 1 1 1 1 1
symmnumber: 1
zpe: 501407.7 jmol-1
zpe.correction: 0.190976 hartree
zpe.thermalcorrener: 0.204320 hartree
zpe.thermalcorrenthalpy: 0.205264 hartree
zpe.thermalcorrgfe: 0.152954 hartree
zpe.sumelectzpe: -574.919303 hartree
zpe.sumelectthermal: -574.905959 hartree
zpe.sumelectthermalent: -574.905015 hartree
zpe.sumelectthermalfe: -574.957325 hartree
dipole: -0.0024 0.0013 0.0014
dipole: 0.0031
quadrupole: -64.8009 -64.8178 -74.3658
quadrupole: 0.0142 0.0011 -0.0015
quadrupole: 3.1939 3.1771 -6.3710 0.0142 0.0011 -0.0015
hfenergy: -575.1102788 hartree
pointgroup: C01 [X(C9H12O3)]
dipole: 0.0005594 -0.0009115 0.0005664 debye
dipolederiv: -0.9780206 -0.5759884 -0.0000234 -0.5565223 -0.5611054 -0.0001005 0.0001385 0.0000391 -0.404796 -1.1558245 0.4534308 0.0001408 0.472775 -0.3835655 0.0000373 0.0000348 0.0000813 -0.4048949 -0.1754379 0.093994 -0.0001862 0.1130679 -1.3633317 -0.0000453 -0.0001509 -0.0001528 -0.40474 -0.5436642 -0.0116937 -0.0000627 -0.0226708 -0.0064935 0.0000195 0.0000099 -0.0003295 -0.1331507 -0.1254414 -0.2186887 0.0000526 -0.2294706 -0.4240661 0.0000429 -0.0003485 0.0001784 -0.1330061 -0.154977 0.2472762 0.0000192 0.23535 -0.3948711 -0.0000817 0.0001863 0.0000604 -0.1332995 0.8820152 0.4229054 -0.0000673 0.3799327 0.6651757 -0.0000128 -0.0001699 0.0000977 0.0560616 1.0665178 -0.2726206 -0.0000037 -0.3151922 0.4798815 -0.0000106 -0.0000563 -0.000077 0.0556389 0.3718103 -0.0865259 -0.0000371 -0.1289102 1.1747536 0.000197 0.0000865 0.0001796 0.0552722 -0.047127 0.0268732 0.0003573 0.0408016 -0.0301422 -0.0000932 0.0004309 0.0000629 0.1244679 -0.0638949 -0.0309399 -0.0003665 -0.0171024 -0.0130473 -0.0003581 -0.0002374 -0.0005243 0.124493 -0.005183 -0.0169044 -0.000047 -0.0034498 -0.0711419 0.0001703 -0.0001166 0.0001385 0.1245918 0.0490365 -0.0988327 0.1101447 -0.0322733 -0.0475207 0.046761 0.085344 0.1029688 -0.0576461 0.0479238 -0.0994051 -0.1108626 -0.032468 -0.0472216 -0.0465258 -0.0858506 -0.1025277 -0.0568949 -0.008764 0.1161241 0.0003998 0.0218474 0.1154738 -0.0000235 0.0002595 -0.0001271 0.1252777 0.0333773 0.0412494 -0.0145297 0.1078516 -0.0319573 -0.1187431 0.0462964 -0.1253157 -0.0576601 0.0337579 0.0403953 0.0153146 0.1075262 -0.0334776 0.1194138 -0.0454056 0.1255999 -0.056587 0.0241453 -0.0410137 -0.0003155 -0.1353742 0.0818612 -0.0004587 -0.0003414 -0.0002312 0.1251377 -0.0803511 -0.041534 0.0954521 0.0255069 0.0811569 -0.0728405 0.1314811 -0.0232415 -0.0569352 0.143498 0.0659284 -0.0000911 -0.0281084 -0.0382286 0.0001785 -0.0000191 0.0001419 0.1253968 -0.0801618 -0.0418463 -0.095384 0.0250164 0.0813684 0.0724795 -0.1315588 0.0229237 -0.0573165 0.3513727 0.1243208 -0.0000078 0.1054806 0.1593608 0.000019 -0.0002113 -0.0000326 0.3467961 0.3069928 -0.1313098 -0.0000331 -0.1498639 0.2042204 -0.00005 0.0000103 -0.0001209 0.3468079 0.1083999 0.0348055 0.0001366 0.0162498 0.4029183 0.000025 0.0001881 0.0002083 0.3469854 unknown
polarizability: 134.4686045|0.0016519|134.4716043|-0.0039329|0.0037196|59.3952345 unknown
InChI: InChI=1S/C9H12O3/c1-4-7(10)5(2)9(12)6(3)8(4)11/h10-12H,1-3H3
charge 0 multiplicity 1
24 atoms
O  -2.404956 -1.443155 0.000179
O  2.451761 -1.360373 0.000039
O  -0.048864 2.804226 0.000443
C  0.052647 -1.438083 0.000037
C  -1.272434 0.673142 0.000144
C  1.218793 0.765549 0.000143
C  -1.183418 -0.740785 0.000107
C  1.232478 -0.653587 0.000055
C  -0.050429 1.395099 0.000229
C  0.102554 -2.954942 0.000038
C  -2.610394 1.389579 0.000182
C  2.508508 1.565317 0.000217
H  -0.3785 -3.39374 0.89965
H  -0.382378 -3.393904 -0.89742
H  1.149447 -3.293982 -0.002189
H  -2.749078 2.025105 0.90027
H  -2.746544 2.029941 -0.896879
H  -3.429165 0.654268 -0.002934
H  3.129904 1.363706 -0.897816
H  2.281707 2.642137 -0.000863
H  3.128825 1.365269 0.899341
H  -2.240616 -2.417476 0.000198
H  3.213657 -0.731167 0.000223
H  -0.975204 3.147853 0.000807
