program: Gaussian 09
title: 000193385
version: EM64L-G09RevD.01
frameworkgroup: C1[X(C12H22O11)]
method: RPBEPBE
basis: SDD
operation: Freq
keyword: #p
keyword: freq=noraman
keyword: PBEPBE/SDD
title: #p freq=noraman PBEPBE/SDD
converged: NO YES NO NO
title: Mulliken charges:
elementType: O O O O O O O O O O O C C C C C C C C C C C C H H H H H H H H H H H H H H H H H H H H H H
charge: -0.312859 -0.323139 -0.308516 -0.437789 -0.444716 -0.449538 -0.476592 -0.486467 -0.424348 -0.507531 -0.421776 0.314019 -0.252330 -0.121401 -0.102756 0.009622 -0.105110 -0.154582 -0.141317 -0.163935 -0.404532 -0.346682 -0.365375 0.293093 0.232709 0.266885 0.256758 0.217289 0.233172 0.243598 0.264458 0.234407 0.243455 0.265393 0.229361 0.229470 0.221761 0.368706 0.353940 0.361762 0.384145 0.395710 0.356518 0.424745 0.350316
chargesum: 0.00000
title: Mulliken charges with hydrogens summed into heavy atoms:
elementType: O O O O O O O O O O O C C C C C C C C C C C C
charge: -0.312859 -0.323139 -0.308516 -0.069082 -0.090776 -0.087776 -0.092448 -0.090757 -0.067830 -0.082786 -0.071459 0.314019 0.040763 0.111309 0.164129 0.266380 0.112178 0.078590 0.102281 0.100523 0.073329 0.148071 0.085855
polarizability: 1.90107526e+02 -1.77898092e+00 1.58225085e+02 -2.10176343e+00 2.59552533e+00 1.43929560e+02
1716.lowfreq: -8.9533 -0.0004 0.0005 0.0009 0.2367 4.8079 29.1114 53.5497 58.5562
frequency: 29.0242 53.5441 58.5380 79.7706 88.4942 99.1303 108.1343 118.4012 140.1392 158.6314 166.3297 174.8537 185.9064 206.9054 224.0453 227.9529 247.3789 259.3166 262.9515 274.8735 287.1473 325.5328 337.3281 347.5499 352.9907 361.9320 383.0315 399.0284 408.9031 435.4764 458.2910 465.6108 480.5469 501.9294 521.6798 538.2570 566.8891 571.4977 607.1654 609.9479 641.5724 668.1730 675.1253 692.1278 725.2870 762.0875 774.2425 793.5737 818.2699 857.1733 862.7750 875.1748 900.1646 926.4664 943.0150 954.9840 961.6691 966.7384 977.6131 984.9804 987.5469 998.8094 1020.3034 1024.0500 1042.9079 1043.5763 1056.9503 1061.9008 1065.9050 1078.2046 1093.7281 1098.1847 1113.9661 1172.0160 1181.0982 1187.9479 1205.6013 1211.0250 1222.9804 1233.5849 1238.4854 1258.8729 1260.0880 1282.3477 1288.2409 1291.6707 1300.5657 1309.3345 1317.5456 1319.1087 1328.2235 1334.9248 1336.8586 1347.5803 1357.9988 1369.3657 1379.5749 1381.4108 1387.1523 1387.5365 1394.2296 1408.5160 1414.4231 1467.6780 1470.7233 1481.5067 1491.6597 2910.2907 2948.7063 2967.1256 2969.7106 2979.1621 2989.9390 3003.8912 3020.3610 3027.0889 3047.6463 3071.0511 3077.2893 3078.8007 3092.2199 3096.1185 3283.5834 3296.8784 3376.1568 3502.4704 3529.5302 3564.0894 3564.8537
redmass: 6.1933 6.6833 5.9670 4.7315 6.2821 5.2882 5.9927 5.2871 6.3985 3.1679 4.5970 6.1388 2.8281 4.8316 4.8961 3.0707 3.9297 3.1400 3.1105 5.2224 2.1404 3.9580 6.3579 6.1691 5.2395 1.3423 4.3532 5.2341 6.1081 2.3675 1.6804 2.2097 1.6874 1.4734 2.2644 4.0375 4.3667 3.1078 4.6480 1.9927 3.2403 4.4349 2.4560 4.5703 3.0492 1.7602 2.1588 3.7323 2.8599 3.6770 3.6539 3.5825 1.5338 3.0980 4.0076 2.9963 4.9632 2.5323 3.2861 4.8516 4.0890 4.1388 2.6052 3.2659 3.9331 3.6695 2.8604 3.1386 4.1114 2.2503 2.9438 3.4285 3.4702 1.6976 1.3569 1.1445 1.1683 1.2527 1.3515 1.2692 1.2423 1.4212 1.1438 1.4602 1.6078 1.2004 1.2917 1.2387 1.2595 1.3093 1.2506 1.2525 1.2503 1.2744 1.2537 1.1658 1.2803 1.3415 1.2632 1.4367 1.2609 1.2155 1.2488 1.0729 1.0636 1.0785 1.1313 1.0766 1.0836 1.0691 1.0857 1.0849 1.0661 1.0623 1.0845 1.0865 1.0870 1.0861 1.0968 1.0940 1.0983 1.0962 1.0643 1.0641 1.0632 1.0646 1.0652 1.0660 1.0663
irintensity: 0.3994 1.2350 1.9492 1.2745 0.3908 7.4687 0.6584 9.6032 1.1921 13.4602 7.3209 4.1508 10.6523 8.0597 3.3299 18.3282 23.3960 17.4542 72.1876 3.3783 87.4432 35.5724 3.3600 18.8337 41.0589 113.0297 9.4531 38.6050 7.4856 15.6777 19.1769 92.2109 65.0659 135.3617 116.5329 12.3033 3.0673 54.1295 31.2776 69.4748 30.4749 8.3075 89.7815 24.4830 34.7476 105.7547 28.1940 19.1640 49.2557 18.9700 20.3152 129.4402 31.4626 141.3645 97.3898 30.0105 47.5803 39.0497 77.0640 134.4565 47.6559 71.8098 45.9874 9.5721 26.1013 94.4026 104.1588 12.0351 86.1349 50.5886 27.1538 77.4702 32.0131 11.7940 18.4588 30.3968 20.0066 35.8356 6.8376 63.4438 39.4971 15.1870 18.9161 5.5059 17.2565 22.5155 5.8705 1.8334 3.9985 23.4907 31.3296 3.5960 16.5781 3.9520 16.1733 4.9938 26.4624 4.5005 23.5358 0.9931 31.5770 44.2259 76.7626 24.1484 16.9465 7.9075 66.3841 907.2392 15.1716 58.9062 63.9252 25.6940 35.3109 29.3193 1.1367 17.5682 43.6711 3.2689 6.1682 29.3952 8.9551 22.7530 81.3545 205.9876 65.9030 24.5758 12.0608 12.5663 10.8098
temp: 298.150 k
press: 1.00000 atm
elementType: 8 8 8 8 8 8 8 8 8 8 8 6 6 6 6 6 6 6 6 6 6 6 6 1 1 1 1 1 1 1 1 1 1 1 1 1 1 1 1 1 1 1 1 1 1
symmnumber: 1
zpe: 939003.6 jmol-1
zpe.correction: 0.357648 hartree
zpe.thermalcorrener: 0.381021 hartree
zpe.thermalcorrenthalpy: 0.381965 hartree
zpe.thermalcorrgfe: 0.306734 hartree
zpe.sumelectzpe: -1295.987771 hartree
zpe.sumelectthermal: -1295.964398 hartree
zpe.sumelectthermalent: -1295.963453 hartree
zpe.sumelectthermalfe: -1296.038685 hartree
dipole: -3.3071 0.6953 0.1667
dipole: 3.3835
quadrupole: -139.3964 -144.4292 -140.7614
quadrupole: -18.4858 -0.1701 -7.7612
quadrupole: 2.1326 -2.9002 0.7676 -18.4858 -0.1701 -7.7612
hfenergy: -1296.3454185 hartree
pointgroup: C01 [X(C12H22O11)]
dipole: 1.3008761 -0.2777962 0.0506334 debye
polarizability: 189.9816545|-3.2753593|153.0763893|-1.979793|-7.2051506|149.2041271 unknown
InChI: InChI=1S/C12H22O11/c13-1-4-6(16)8(18)9(19)11(21-4)23-12(3-15)10(20)7(17)5(2-14)22-12/h4-11,13-20H,1-3H2
charge 0 multiplicity 1
45 atoms
O  -1.758637 -0.879663 -0.563442
O  -0.483581 0.35985 1.10591
O  0.970659 -1.011615 -0.14059
O  -2.70182 1.278973 2.241589
O  -4.455615 1.224811 -0.672326
O  1.062807 2.202071 0.161846
O  3.613878 2.154472 -0.400644
O  2.645981 0.432907 -2.154958
O  -2.724451 -2.691999 1.293246
O  -0.064205 0.095838 -2.395124
O  2.11849 -3.192256 1.265101
C  -1.639128 -0.531403 0.846315
C  -2.852797 0.404498 1.096384
C  -3.051467 1.154472 -0.263716
C  -2.288973 0.317405 -1.312363
C  0.878446 -0.104253 1.019708
C  1.769279 1.167647 0.906695
C  3.162461 0.896935 0.212283
C  3.139789 -0.176601 -0.919178
C  2.343639 -1.421015 -0.498021
C  -1.588565 -1.841469 1.645246
C  -1.08765 1.063613 -1.950547
C  3.028194 -2.243197 0.623933
H  -3.738463 -0.223434 1.292658
H  -2.619782 2.172319 -0.167872
H  -2.977864 -0.092136 -2.066891
H  1.156918 -0.693319 1.918916
H  1.96033 1.525627 1.941156
H  3.906807 0.62051 0.978526
H  4.185063 -0.462805 -1.141615
H  2.18529 -2.065497 -1.383314
H  -1.695622 -1.619446 2.719243
H  -0.624467 -2.357457 1.46436
H  -0.629692 1.751971 -1.216484
H  -1.418495 1.616236 -2.845638
H  3.380286 -1.608074 1.453451
H  3.911857 -2.755614 0.187349
H  -1.777779 1.646762 2.204441
H  -4.952978 1.763095 -0.005449
H  1.795018 2.80955 -0.15402
H  3.450499 2.016233 -1.386314
H  1.621588 0.420972 -2.235182
H  -2.740707 -2.75478 0.301755
H  -0.036022 -0.597524 -1.665293
H  1.69218 -3.765408 0.578467
