program: Gaussian 09
title: 000193372
version: EM64L-G09RevD.01
frameworkgroup: C1[X(C7H12N2O5)]
method: RPBEPBE
basis: SDD
operation: Freq
keyword: #p
keyword: freq=noraman
keyword: PBEPBE/SDD
title: #p freq=noraman PBEPBE/SDD
converged: YES YES NO NO
title: Mulliken charges:
elementType: O O O O O N N C C C C C C C H H H H H H H H H H H H
charge: -0.423127 -0.289207 -0.279166 -0.451581 -0.209400 -0.409706 -0.374226 -0.236780 -0.337845 0.255287 -0.385250 0.246201 -0.771233 0.184220 0.268016 0.258505 0.203115 0.351235 0.360392 0.280699 0.287931 0.346602 0.252591 0.253368 0.220436 0.398923
chargesum: 0.00000
title: Mulliken charges with hydrogens summed into heavy atoms:
elementType: O O O O O N N C C C C C C C
charge: -0.076525 -0.289207 -0.279166 -0.052658 -0.209400 -0.058471 -0.013834 0.031236 0.123775 0.255287 0.183380 0.246201 -0.044838 0.184220
polarizability: 1.41807755e+02 4.58106432e+00 9.65118069e+01 2.08990409e+00 -1.35815150e+01 7.82973667e+01
1716.lowfreq: -18.0021 -2.6158 0.0004 0.0007 0.0010 5.3554 19.8297 40.5423 53.6509
frequency: 19.6436 40.4967 53.6153 60.8029 67.9055 75.0153 87.8461 100.7404 147.8959 176.9125 222.6178 224.4829 275.0377 297.9127 341.6260 377.7438 444.9749 490.4184 522.2992 535.0624 546.4042 585.7489 600.6673 612.1504 650.1507 665.8158 728.7941 776.5224 818.4676 857.5424 911.9531 950.2632 977.3009 980.5886 1008.4294 1026.4581 1043.1487 1078.8452 1098.7273 1136.2270 1182.8812 1210.0241 1215.9209 1236.3192 1257.5163 1302.1062 1318.6156 1334.1319 1343.6227 1373.3392 1388.3960 1449.9144 1455.6781 1457.3916 1473.8114 1476.0926 1504.9479 1597.3485 1619.1687 1688.9375 2980.8482 2996.4049 2998.6168 3007.4046 3036.5203 3079.8649 3097.6765 3104.3984 3441.7076 3535.5234 3547.5839 3549.9991
redmass: 5.4607 8.5120 2.3715 1.9573 4.2682 3.0088 5.9654 3.7317 3.6067 3.3840 6.6328 4.0617 3.6160 6.4549 3.1848 1.3646 3.3737 1.8892 4.7394 4.6212 4.0377 3.8105 1.3163 3.0682 1.4844 3.4270 1.1467 5.9193 4.6992 3.5365 3.8338 3.0772 1.9520 1.9455 2.9934 1.7886 1.6568 2.1084 4.1177 1.9463 1.5397 1.5005 1.1101 1.6761 1.7045 2.2373 1.5171 1.2790 1.6464 1.2447 1.2328 1.0605 1.4535 1.0997 1.4680 1.0953 2.1887 8.7946 6.2452 9.3260 1.0804 1.0602 1.0358 1.0633 1.0997 1.1038 1.0977 1.1014 1.0779 1.0646 1.0782 1.0657
irintensity: 0.1098 5.0717 0.8030 2.8154 5.2716 2.2901 11.2613 0.8861 14.7311 10.3599 1.5897 11.0862 17.0022 3.5955 8.0321 144.0889 35.8272 52.0343 15.9831 3.3623 44.5105 9.8752 42.5514 5.1750 205.8612 10.7345 86.3583 7.1720 5.8501 16.3812 53.7345 36.4544 14.1380 1.1897 43.0390 19.2019 14.7841 229.1556 13.7221 10.0568 10.4112 9.4772 1.6037 13.9631 19.8573 47.2261 7.0737 16.2257 13.1263 26.4873 70.8531 39.6362 412.3795 23.0400 221.1813 24.5381 214.3065 262.1451 62.7958 261.3622 17.5736 21.2065 8.1186 30.4694 3.5038 33.5488 8.1821 19.2281 126.0950 35.5901 77.5378 2.6106
temp: 298.150 k
press: 1.00000 atm
elementType: 8 8 8 8 8 7 7 6 6 6 6 6 6 6 1 1 1 1 1 1 1 1 1 1 1 1
symmnumber: 1
zpe: 525638.9 jmol-1
zpe.correction: 0.200205 hartree
zpe.thermalcorrener: 0.216069 hartree
zpe.thermalcorrenthalpy: 0.217013 hartree
zpe.thermalcorrgfe: 0.154167 hartree
zpe.sumelectzpe: -758.497586 hartree
zpe.sumelectthermal: -758.481722 hartree
zpe.sumelectthermalent: -758.480778 hartree
zpe.sumelectthermalfe: -758.543623 hartree
dipole: 0.9917 0.1819 -0.9369
dipole: 1.3763
quadrupole: -84.9250 -85.2576 -85.9322
quadrupole: 17.6883 -14.4090 -1.2023
quadrupole: 0.4466 0.1140 -0.5606 17.6883 -14.4090 -1.2023
hfenergy: -758.6977908 hartree
pointgroup: C01 [X(C7H12N2O5)]
dipole: -0.3540886 -0.0393476 0.4077796 debye
dipolederiv: -0.2668909 -0.1489813 -0.052849 -0.1769464 -0.5992641 0.1591231 -0.0532322 0.2285383 -0.6626896 -0.8290355 -0.0663329 0.0098821 0.2162794 -0.6380983 -0.2825862 0.2949537 -0.3037937 -0.6207297 -0.7924732 0.0548101 -0.0531174 -0.1450746 -0.5509731 -0.2765786 -0.3200561 -0.2055172 -0.7537114 -0.4340511 -0.0886802 -0.0750922 -0.1681208 -0.8267464 -0.3775397 -0.1494972 -0.38633 -0.7834742 -1.1192258 -0.2184186 -0.1098737 -0.0508898 -0.4704238 -0.1431556 0.0394277 -0.1244787 -0.4432591 -1.348263 0.0582419 -0.1921418 -0.0364202 -0.4795246 0.0608403 -0.4375554 0.0351805 -0.5232779 -1.2828951 0.0858003 0.2528461 0.1172523 -0.4130003 -0.0237548 0.3387394 -0.0357939 -0.5194338 0.2160863 -0.1896558 -0.0681393 -0.3307483 0.0395361 -0.0475149 -0.2422507 -0.1407917 0.1537456 0.1209564 0.0148219 -0.0326589 0.0946625 0.3861035 -0.1089091 0.0091393 -0.1298928 0.5430038 1.5191717 0.0634126 -0.2739 -0.2190101 0.6043851 0.4242931 -0.4819142 0.4695164 0.6671499 0.3396811 0.1553767 0.1295799 0.3476851 0.1727276 -0.1615089 0.3165099 -0.1373133 0.1087786 1.6891384 -0.1815378 0.2478917 0.0130841 0.4981046 0.4315266 0.4821392 0.3640319 0.8278523 -0.3044899 0.1791242 0.147682 0.168075 -0.0789769 -0.0724868 0.1266652 -0.0725518 -0.0383381 1.4795578 0.2029771 0.0416855 0.1124185 0.8781757 0.6328338 -0.0328936 0.6184114 0.823831 0.0296362 0.010996 -0.008642 0.0315757 0.0436171 0.0359898 0.1051454 0.0283216 -0.072054 -0.0404027 -0.1086703 -0.0803434 -0.1100019 0.0334416 -0.0023944 -0.0244533 0.0064874 -0.0148194 -0.0752294 0.094092 0.1149924 0.1118582 0.0486947 -0.0127784 0.0737846 -0.0100847 -0.0277377 0.4131909 0.0281776 -0.0272793 0.1319765 0.2331158 -0.0642907 0.1321057 -0.0549016 0.2430832 0.3063375 -0.0281392 -0.0462958 -0.0587634 0.2405813 -0.0746912 -0.1110256 -0.0679089 0.2796563 -0.0063538 -0.0000222 0.0172082 -0.0920814 -0.0201655 0.0381655 -0.0316983 0.0347218 0.1084094 -0.0018455 0.0036503 0.0085417 -0.0367768 0.1035416 0.0379685 -0.1003326 0.0247606 0.0052784 0.1459045 0.1225185 0.0726731 0.1134016 0.3285811 -0.1303895 0.0594176 -0.0768794 0.2675872 0.0129179 -0.069984 0.0500765 -0.1066192 0.0194959 0.0381105 0.0688198 0.0002517 0.0857487 0.084511 0.0515868 -0.0384724 0.0845049 0.0277253 0.0509605 -0.0545038 0.0854992 0.0125987 0.0431115 -0.051018 -0.0915286 -0.0085081 0.0414552 -0.0994447 -0.030769 -0.114603 -0.0461935 0.1009545 0.0258542 0.0572745 -0.0028129 0.3778906 -0.0317881 0.0233345 -0.0348799 0.3789953 unknown
polarizability: 141.486192|-3.3417317|87.4150633|-4.36188|16.7318142|87.7156736 unknown
InChI: InChI=1S/C7H12N2O5/c1-4(11)9-5(3-10)7(14)8-2-6(12)13/h5,8-10,12H,2-3H2,1H3
charge 0 multiplicity 1
26 atoms
O  0.701433 2.088566 -1.359584
O  -0.143928 -1.367298 -1.126886
O  3.704412 0.503721 1.15989
O  -3.557974 0.860142 1.494091
O  -5.075289 -0.48794 0.35347
N  2.175632 -0.344896 -0.365102
N  -1.421513 -0.130198 0.356665
C  1.022378 0.258144 0.312671
C  0.95173 1.789174 0.049799
C  -0.227718 -0.481739 -0.215296
C  -2.675172 -0.718522 -0.117561
C  3.457839 -0.223749 0.146697
C  4.540747 -1.007186 -0.585925
C  -3.899505 -0.13946 0.567606
H  1.120363 0.115052 1.40896
H  1.896163 2.239723 0.410561
H  0.10816 2.245106 0.595713
H  1.930557 -1.043448 -1.080272
H  -1.486135 0.606184 1.06275
H  -2.682385 -1.814995 0.034731
H  -2.787583 -0.571662 -1.209561
H  1.429565 1.679447 -1.894201
H  5.327707 -0.310628 -0.922632
H  5.012843 -1.713191 0.119174
H  4.161499 -1.569015 -1.456265
H  -4.378028 1.226965 1.920207
