program: Gaussian 09
title: 000193368
version: EM64L-G09RevD.01
frameworkgroup: C1[X(C7H13NO4S)]
method: RPBEPBE
basis: SDD
operation: Freq
keyword: #p
keyword: freq=noraman
keyword: PBEPBE/SDD
title: #p freq=noraman PBEPBE/SDD
converged: YES YES NO NO
title: Mulliken charges:
elementType: S O O O O N C C C C C C C H H H H H H H H H H H H H
charge: 0.640119 -0.404068 -0.233112 -0.631564 -0.287139 -0.397044 -0.403475 -0.139736 -0.678122 0.153517 0.250976 -0.811070 -0.774394 0.310091 0.253264 0.297271 0.317497 0.272075 0.336748 0.249194 0.270606 0.284889 0.258706 0.222878 0.251065 0.390827
chargesum: 0.00000
title: Mulliken charges with hydrogens summed into heavy atoms:
elementType: S O O O O N C C C C C C C
charge: 0.640119 -0.013241 -0.233112 -0.631564 -0.287139 -0.060295 0.159880 0.157535 -0.088550 0.153517 0.250976 -0.006381 -0.041745
polarizability: 1.17317046e+02 -1.27272957e+01 1.23713230e+02 6.45239027e-01 -1.76200441e+00 1.06191583e+02
1716.lowfreq: -0.0026 -0.0018 0.0019 1.9936 5.2251 8.7967 38.5487 47.3356 55.5162
frequency: 38.4767 47.1501 55.4359 66.0013 76.0892 78.0974 106.6419 142.6989 157.2643 197.7341 239.0138 257.6789 275.9540 276.6872 298.2984 345.7554 401.5573 433.6790 468.0514 512.9874 563.5741 570.3761 590.1099 602.7744 612.7139 633.2639 695.1358 785.4766 787.5781 870.1885 907.1798 965.6487 967.1120 973.0166 992.2889 1015.2125 1040.9978 1059.4679 1075.8818 1120.4994 1161.0286 1185.7939 1235.2026 1262.0995 1278.4670 1303.4874 1321.2150 1345.3539 1365.8423 1389.7693 1420.6445 1438.3357 1450.8736 1453.1061 1465.8810 1474.4947 1492.8236 1604.1078 1653.5827 2820.0306 2998.5685 3016.1979 3021.1086 3044.6011 3061.5720 3096.4135 3104.6605 3132.9339 3156.2889 3164.5682 3510.9197 3518.0537
redmass: 4.8418 5.8212 4.1607 7.0376 1.3999 3.7026 2.9115 4.2786 5.1900 1.0830 2.7977 4.0345 4.3775 3.2773 7.5101 4.1476 3.3231 4.4502 3.7387 3.5524 5.5563 2.6159 2.9063 1.8754 2.7257 1.3856 3.6768 11.8252 1.5810 3.9723 1.6371 1.6550 1.6027 1.9310 1.5837 3.6257 1.6520 2.6510 2.1726 1.9754 1.4858 1.3012 1.3204 1.7171 1.3336 1.1444 1.3973 1.9173 1.2834 1.2259 1.0537 1.0607 1.0521 1.1032 1.1155 1.1006 1.8275 5.9881 8.4813 1.0739 1.0360 1.0260 1.0830 1.0585 1.0862 1.0978 1.1012 1.1097 1.1056 1.1060 1.0776 1.0643
irintensity: 3.6046 10.9137 3.6569 6.4280 0.7163 4.2735 2.1552 1.5132 11.3769 0.6247 4.0460 7.0824 7.2088 6.4160 8.0453 2.4683 12.4530 7.5850 13.6606 31.0543 10.9750 14.2316 9.6583 124.2820 29.8079 93.0894 46.9468 31.0325 13.6524 2.0843 3.5116 18.1269 10.9943 8.3835 24.0562 8.0412 18.5543 190.6533 47.3723 6.7908 7.0236 3.7217 3.8602 18.8769 18.3154 4.7787 35.0139 112.4037 6.8726 68.5158 16.6693 21.2597 13.3023 21.1399 60.3730 58.0514 132.6961 180.5427 173.3936 42.3967 6.6748 7.4978 9.8548 16.1064 15.3569 8.2522 15.6234 5.0754 4.8723 3.4114 58.3788 30.2908
temp: 298.150 k
press: 1.00000 atm
elementType: 16 8 8 8 8 7 6 6 6 6 6 6 6 1 1 1 1 1 1 1 1 1 1 1 1 1
symmnumber: 1
zpe: 527862.8 jmol-1
zpe.correction: 0.201052 hartree
zpe.thermalcorrener: 0.216909 hartree
zpe.thermalcorrenthalpy: 0.217853 hartree
zpe.thermalcorrgfe: 0.156403 hartree
zpe.sumelectzpe: -1027.160860 hartree
zpe.sumelectthermal: -1027.145004 hartree
zpe.sumelectthermalent: -1027.144059 hartree
zpe.sumelectthermalfe: -1027.205509 hartree
dipole: 0.7947 1.4467 0.8302
dipole: 1.8476
quadrupole: -77.8739 -84.4515 -94.2168
quadrupole: -12.2414 -3.4210 -14.0412
quadrupole: 7.6402 1.0625 -8.7027 -12.2414 -3.4210 -14.0412
hfenergy: -1027.3619126 hartree
pointgroup: C01 [X(C7H13N1O4S1)]
dipole: 0.5282529 0.4011086 0.2974358 debye
dipolederiv: 0.3505868 0.1572465 0.1106206 0.1930323 0.5820382 0.0321026 0.2426265 0.1486184 0.4117058 -0.4261771 0.1730893 -0.1442275 0.1585819 -1.0929961 0.4030852 -0.121265 0.3605563 -0.4711225 -0.4710215 0.0802295 0.2438657 0.1731555 -0.6480369 -0.0126694 0.2871753 0.1754289 -0.8315278 -0.5440174 0.0595854 0.0157148 -0.1449697 -0.5098578 0.0346786 -0.2813358 -0.1691062 -0.473296 -0.4757005 -0.0872463 0.0316488 -0.1050516 -0.6710039 -0.0172507 0.0232937 -0.2408535 -0.9167039 -0.5923074 -0.1224903 -0.0411989 -0.1784179 -1.0883878 -0.2253537 -0.0076265 -0.2405447 -0.4211907 -0.00354 -0.0058991 -0.0168061 0.0591989 -0.0937625 -0.1256064 -0.1367447 0.0338519 -0.0738155 0.1482477 0.2115022 0.1221778 0.2359016 0.3199888 -0.0409767 0.1433834 -0.3517044 0.0356263 0.0319639 -0.0902109 -0.098394 -0.1324967 0.0334797 -0.0645406 -0.012777 -0.1019389 -0.0359918 0.522308 -0.3810103 -0.2850846 -0.5347934 1.3613522 -0.25634 -0.3878225 -0.3113015 1.1165116 0.2676942 0.2356187 -0.0481797 0.3048865 1.392998 0.1889902 -0.0280553 0.3712598 1.0829337 -0.0807076 -0.1000507 0.0176419 -0.0180363 -0.1983069 -0.0084614 0.0158793 0.0220029 -0.0181915 -0.0032586 -0.092629 0.0626593 -0.0962828 -0.3198611 0.1832362 0.051457 0.1578923 -0.0598653 0.1898413 -0.0765226 0.0212137 -0.0224597 0.1353136 0.0052168 0.1201693 -0.0585818 0.0462084 0.0229713 -0.012234 -0.0096777 0.0117444 -0.0814686 0.0640905 0.020269 0.0921882 0.0843686 0.0574164 0.0062572 -0.0103227 -0.034198 0.0916492 -0.0233205 -0.075329 0.0749188 0.0315453 0.107245 0.0361175 -0.0705183 0.0795423 0.0029819 -0.0144447 -0.046469 0.0011098 0.0602671 -0.0228527 0.0303683 0.0360563 -0.0034702 0.0469345 0.074244 0.0581475 0.0556912 -0.058813 0.3352419 -0.0677076 0.0088588 -0.0418116 0.2231056 -0.0082951 -0.0055502 0.0875626 0.1666248 0.1275467 -0.0523807 -0.0197395 0.0023998 -0.0345038 -0.0618215 -0.000671 -0.0599123 -0.0240739 0.0158976 0.0345758 -0.0724927 0.0314212 0.0426819 0.0323053 -0.0846651 0.0636649 0.051773 0.0086359 -0.0356033 0.0772095 -0.0108366 0.0127775 -0.0157847 0.0858553 0.006554 0.0545191 -0.0401124 -0.0890299 -0.0250742 -0.0430724 0.0968246 0.0002289 -0.0576014 0.0022425 0.0835971 0.1187091 -0.0016628 -0.0187766 -0.0120168 0.048512 -0.0844282 0.0073495 -0.0087707 -0.1185001 0.0304277 0.1372218 0.0167994 0.0894299 0.0325953 -0.0098051 0.0569012 -0.011728 0.0743993 0.3249616 0.0528653 0.096026 0.0386195 0.3149522 -0.0490797 0.1334055 -0.0991002 0.2030119 unknown
polarizability: 109.3803646|-7.116648|131.6753834|-0.6018416|-0.3027342|106.1661108 unknown
InChI: InChI=1S/C7H13NO4S/c1-5(9)8-6(7(10)11)3-4-13(2)12/h6,8,10H,3-4H2,1-2H3
charge 0 multiplicity 1
26 atoms
S  -3.290896 0.114084 0.372811
O  1.674846 -2.895317 0.312313
O  1.955297 -1.577473 -1.580077
O  -3.091976 -0.768594 -1.043648
O  0.810121 1.913264 1.505966
N  0.747915 0.569814 -0.39161
C  -0.76555 -1.240855 0.569581
C  0.681875 -0.696011 0.352309
C  -1.629615 -0.327626 1.432184
C  1.50271 -1.726669 -0.422919
C  0.895417 1.793599 0.241866
C  -2.781263 1.886345 -0.152105
C  1.159335 2.983263 -0.67334
H  -1.278498 -1.365233 -0.420619
H  -0.690218 -2.244895 1.021203
H  1.152493 -0.530479 1.340183
H  -1.169824 0.640992 1.683533
H  -2.038047 -0.807588 2.334375
H  0.901228 0.488614 -1.401761
H  -2.72944 2.529154 0.740225
H  -3.557763 2.225235 -0.852819
H  -1.807102 1.794228 -0.652587
H  2.152099 3.403083 -0.434102
H  1.130335 2.728988 -1.74641
H  0.416432 3.773171 -0.469274
H  2.185392 -3.560492 -0.224373
