program: Gaussian 09
title: 000193365
version: EM64L-G09RevD.01
frameworkgroup: C1[X(C21H28O5)]
method: RPBEPBE
basis: SDD
operation: Freq
keyword: #pfreq=noraman
keyword: PBEPBE/SDD
title: #p freq=noraman PBEPBE/SDD
converged: YES YES NO NO
title: Mulliken charges:
elementType: O O O O O C C C C C C C C C C C C C C C C C C C C C H H H H H H H H H H H H H H H H H H H H H H H H H H H H
charge: -0.458302 -0.201303 -0.487683 -0.433974 -0.251157 0.320141 -0.126099 -0.137714 0.274089 -0.264349 -0.555917 -0.663176 -0.523688 0.078488 -0.474397 0.146187 -0.824456 -0.305430 -0.650392 0.568435 -0.772284 -0.164498 -0.328669 -0.640045 -0.407743 0.179345 0.274382 0.240213 0.264691 0.228846 0.232705 0.263170 0.215682 0.225396 0.247926 0.232336 0.224760 0.239615 0.213740 0.245228 0.251897 0.223766 0.239310 0.360045 0.212483 0.270099 0.240489 0.281851 0.224330 0.216307 0.262821 0.365620 0.253723 0.353158
chargesum: 0.00000
title: Mulliken charges with hydrogens summed into heavy atoms:
elementType: O O O O O C C C C C C C C C C C C C C C C C C C C C
charge: -0.098257 -0.201303 -0.122063 -0.080816 -0.251157 0.320141 0.148283 0.102499 0.274089 0.000343 -0.094366 -0.184324 -0.050365 0.078488 -0.017301 0.146187 -0.125872 -0.053533 -0.187316 0.568435 -0.049212 0.117353 0.111967 -0.377224 -0.154020 0.179345
polarizability: 3.07601840e+02 -7.34006399e+00 2.16915741e+02 -2.63794753e+01 2.95611252e-01 1.85050135e+02
1716.lowfreq: -10.5379 -0.0007 -0.0005 0.0003 0.6367 8.3840 27.6436 45.4844 58.4929
frequency: 27.5703 45.4578 58.4729 75.2536 80.4004 89.6599 114.4346 129.1104 151.9313 160.8745 175.6976 195.8843 211.8749 218.1135 231.9375 234.2779 251.6351 255.8081 264.5203 276.5602 296.3612 307.6832 313.5829 319.0153 327.4955 348.5712 351.6452 364.1139 390.4782 414.3555 419.2840 436.3837 450.4929 472.0304 485.4494 495.3771 505.3167 519.8177 531.9406 559.7012 582.5842 600.6706 617.4728 638.1643 662.4278 681.4249 694.9891 717.9484 744.4141 767.9035 789.5641 808.1167 821.8103 831.4381 844.6117 863.5902 883.3155 904.8758 911.5984 915.0037 916.9122 944.0828 948.6712 956.0167 960.2411 977.4707 992.5406 999.5555 1011.3571 1012.8812 1017.5933 1029.5849 1042.4186 1045.1705 1056.1628 1065.1308 1086.1405 1099.4670 1109.5089 1118.2926 1133.6067 1139.3691 1147.8878 1150.2474 1159.0299 1173.6163 1185.6296 1197.0986 1208.3709 1224.5111 1236.4038 1241.2563 1244.5599 1251.2000 1262.0208 1271.8366 1275.3338 1287.5152 1289.1470 1294.4580 1298.6300 1307.2054 1311.1382 1322.5285 1329.1272 1343.3801 1346.1668 1349.1839 1354.5279 1365.5942 1374.5130 1385.0557 1388.8365 1403.1870 1440.3750 1457.1297 1463.4579 1465.2077 1466.0829 1473.4454 1475.4612 1487.2842 1489.2996 1493.6377 1556.9969 1611.3046 1613.8370 1661.1978 2934.0398 2956.3377 2969.7002 2972.5441 2977.0521 2982.5097 2983.9789 2984.6789 2991.3155 2995.5911 3012.8024 3028.7699 3041.1976 3050.5848 3050.9489 3060.8606 3065.7234 3083.9727 3088.5503 3088.6946 3098.0904 3110.7819 3126.4111 3130.9398 3156.6002 3447.6185 3531.1806 3594.8661
redmass: 8.3267 4.1950 5.9350 4.6356 5.0420 3.5728 4.6551 2.9183 4.1860 2.6459 5.3510 3.9420 2.5445 2.4416 1.4475 2.0830 3.3588 2.1647 4.3573 2.2064 2.4591 2.0868 1.5718 3.1219 4.1431 3.9465 3.6567 2.7404 3.1162 3.8214 3.1729 3.4983 2.8105 3.9249 1.2466 2.9113 4.2694 3.3607 2.6965 3.8753 1.1878 3.3470 2.9838 3.8584 3.9065 3.6274 3.0781 3.9281 4.0307 3.1668 2.0431 2.3560 2.2036 1.5737 2.3170 2.8227 2.4016 1.8169 2.1938 2.0149 2.4809 2.3461 1.9513 1.9246 2.9459 2.6508 2.3653 2.0096 2.2085 1.4037 3.1506 1.9268 2.0080 2.6665 2.1992 2.4065 2.1615 2.0165 2.0408 2.4516 2.3019 1.4365 1.5621 1.5249 1.9737 1.8905 1.6431 1.9575 1.9878 1.5053 1.3221 1.4563 1.5521 1.4682 1.3800 1.4079 1.3957 1.6681 1.4744 1.6254 1.5114 1.4965 1.3179 1.3041 1.3581 1.3901 1.4917 1.7629 1.5204 1.5107 2.0524 1.3094 1.2678 1.1921 1.0917 1.0780 1.0845 1.0839 1.0921 1.0644 1.0703 1.0582 1.0695 1.0564 8.6625 8.5361 8.9104 7.3444 1.0797 1.0804 1.0674 1.0629 1.0570 1.0720 1.0438 1.0672 1.0644 1.0363 1.0644 1.0845 1.0986 1.1024 1.0992 1.0988 1.0967 1.0994 1.0995 1.1004 1.0970 1.1004 1.0918 1.0857 1.0988 1.0646 1.0649 1.0666
irintensity: 1.8095 0.6888 0.5580 7.0704 0.9949 2.8485 3.8934 2.7750 4.5240 1.6604 1.3673 6.3844 0.8475 0.6991 1.0066 1.2617 1.8211 2.5602 8.9732 0.1300 0.3916 32.4277 70.4702 24.6986 1.9474 12.4794 2.5524 1.3783 2.1470 1.8654 2.3492 5.2552 1.4683 7.3525 161.4840 14.9238 12.9374 21.6777 22.0461 3.2074 222.7920 25.0654 5.9247 3.2636 1.6321 12.7938 6.9771 3.8668 3.6402 12.7999 3.1457 5.0699 14.5421 26.2415 30.5521 7.5556 4.3492 41.3843 12.5048 15.5230 26.7965 8.5652 26.7057 14.4328 46.0201 29.0646 0.9219 63.4732 2.3406 2.1603 56.7265 6.4138 23.4608 8.3159 3.4949 5.7989 7.4267 11.5559 1.2932 5.9727 11.9952 15.5221 7.1802 21.6444 9.7348 5.1300 12.6140 48.7892 9.7574 11.9328 2.1461 50.7863 10.0661 37.7052 20.0144 6.4528 33.4330 5.4677 4.7204 32.6757 13.4894 5.8590 13.2759 8.4808 1.9642 19.8302 1.0914 2.0503 25.4415 6.5454 13.3819 20.4291 28.3442 28.6816 7.8544 6.0696 18.5831 5.3106 6.4032 13.1943 9.6759 7.7358 1.5770 8.6248 185.7277 13.0620 125.1777 156.2403 7.0740 3.2683 16.0212 19.8835 14.5257 10.0637 33.7913 22.6571 28.7931 34.9550 33.6826 22.7946 42.3395 15.5322 44.0627 22.1362 34.8023 33.4806 21.9028 24.1441 21.5010 4.6794 10.4998 0.1277 13.3327 36.3680 10.6914 8.6203
temp: 298.150 k
press: 1.00000 atm
elementType: 8 8 8 8 8 6 6 6 6 6 6 6 6 6 6 6 6 6 6 6 6 6 6 6 6 6 1 1 1 1 1 1 1 1 1 1 1 1 1 1 1 1 1 1 1 1 1 1 1 1 1 1 1 1
symmnumber: 1
zpe: 1185217.7 jmol-1
zpe.correction: 0.451426 hartree
zpe.thermalcorrener: 0.476097 hartree
zpe.thermalcorrenthalpy: 0.477041 hartree
zpe.thermalcorrgfe: 0.399348 hartree
zpe.sumelectzpe: -1191.138252 hartree
zpe.sumelectthermal: -1191.113580 hartree
zpe.sumelectthermalent: -1191.112636 hartree
zpe.sumelectthermalfe: -1191.190329 hartree
dipole: -4.2035 2.1399 3.2710
dipole: 5.7400
quadrupole: -222.4574 -147.6724 -161.4609
quadrupole: 9.2271 13.0873 4.4621
quadrupole: -45.2605 29.5245 15.7360 9.2271 13.0873 4.4621
hfenergy: -1191.5896775 hartree
pointgroup: C01 [X(C21H28O5)]
dipole: -1.6686479 0.8080692 1.2894033 debye
polarizability: 308.2443485|-6.8291539|216.9081822|-24.9558702|1.2248176|184.4151854 unknown
InChI: InChI=1S/C21H28O5/c1-19-7-5-13(23)9-12(19)3-4-14-15-6-8-21(26,17(25)11-22)20(15,2)10-16(24)18(14)19/h5,7,9,14-15,17-18,22,25-26H,3-4,6,8,10-11H2,1-2H3
charge 0 multiplicity 1
54 atoms
O  -3.032732 0.248057 -1.889524
O  0.567951 -2.455181 1.022028
O  -4.429945 -1.750465 -0.686344
O  -6.925877 -0.641819 -0.268525
O  6.203589 -0.392858 -1.740055
C  -1.867209 -0.048516 0.304169
C  -0.957737 1.164061 -0.078367
C  0.454145 1.102757 0.537807
C  -3.205622 0.386414 -0.426383
C  1.1541 -0.236179 0.08519
C  -1.842796 2.398285 0.21915
C  -1.184526 -1.337604 -0.230038
C  -3.290927 1.915424 -0.12279
C  2.639721 -0.377036 0.62492
C  1.310506 2.319493 0.118861
C  0.227921 -1.440778 0.353555
C  -2.090687 -0.176249 1.834575
C  -4.485599 -0.397504 -0.04501
C  2.766778 2.211182 0.640926
C  3.386868 0.896939 0.211287
C  2.678155 -0.517323 2.188947
C  3.280198 -1.633472 0.053398
C  -5.785021 0.209901 -0.603004
C  4.52859 0.862086 -0.542951
C  4.4183 -1.64106 -0.697125
C  5.132837 -0.391013 -1.044999
H  -0.841681 1.111745 -1.182512
H  0.373987 1.106812 1.644492
H  1.226181 -0.1685 -1.025026
H  -1.551737 3.27414 -0.384878
H  -1.763646 2.693364 1.283167
H  -1.130442 -1.274135 -1.3348
H  -1.716094 -2.264869 0.052835
H  -3.982212 2.113671 0.716662
H  -3.696754 2.419724 -1.015319
H  0.847847 3.248071 0.503154
H  1.323014 2.393443 -0.98772
H  -2.616086 0.698785 2.255628
H  -2.684806 -1.076868 2.077982
H  -1.134304 -0.28394 2.375374
H  -4.585489 -0.510533 1.050224
H  2.753484 2.287334 1.747397
H  3.370694 3.056789 0.266404
H  -3.323651 -0.681597 -2.107407
H  2.164058 0.321939 2.688979
H  2.192638 -1.457442 2.495128
H  3.726743 -0.529829 2.533474
H  2.784989 -2.573416 0.323031
H  -5.995419 1.183897 -0.13455
H  -5.68675 0.348864 -1.698986
H  5.046637 1.788488 -0.821892
H  -3.917504 -2.376926 -0.118409
H  4.858052 -2.575481 -1.065132
H  -6.69543 -1.554471 -0.585809
