program: Gaussian 09
title: 000193327
version: EM64L-G09RevD.01
frameworkgroup: C1[X(C8H4Cl4O)]
method: RPBEPBE
basis: SDD
operation: Freq
keyword: #p
keyword: freq=noraman
keyword: PBEPBE/SDD
title: #p freq=noraman PBEPBE/SDD
converged: YES YES NO NO
title: Mulliken charges:
elementType: Cl Cl Cl Cl O C C C C C C C C H H H H
charge: -0.013531 0.022222 0.032212 -0.011571 -0.178228 0.431352 -0.318630 -0.288629 0.216066 -0.107707 -0.179123 -0.082771 -0.710093 0.314142 0.289719 0.296057 0.288513
chargesum: 0.00000
title: Mulliken charges with hydrogens summed into heavy atoms:
elementType: Cl Cl Cl Cl O C C C C C C C C
charge: -0.013531 0.022222 0.032212 -0.011571 -0.178228 0.431352 -0.318630 0.025513 0.216066 -0.107707 0.110596 -0.082771 -0.125523
polarizability: 2.05267651e+02 2.44118159e-01 1.39752010e+02 -2.61234680e+00 1.57205038e+00 5.02918556e+01
1716.lowfreq: -2.6252 0.0031 0.0031 0.0036 3.2305 7.6831 13.1756 54.2252 104.1179
frequency: 12.4514 54.2242 104.1175 110.1401 123.4286 178.4835 198.3716 199.4222 224.1248 230.8742 307.4539 320.9369 347.3927 437.1264 471.2842 516.2411 543.6054 548.6047 618.5732 659.1143 690.7209 700.7967 755.4312 828.4336 864.8037 903.9997 943.4353 998.4337 1053.5668 1125.4518 1146.9742 1169.4062 1241.5535 1277.3088 1318.5526 1372.4102 1401.6155 1430.9447 1535.2863 1568.3573 1605.4601 3046.7462 3120.4659 3159.2818 3183.2229
redmass: 17.6815 18.6103 4.5324 13.1267 5.5241 26.6124 10.8673 7.7362 17.0049 10.3016 21.3236 10.0037 16.1769 3.2663 9.5989 3.9886 6.7598 8.5165 5.4916 7.8078 5.7003 4.3082 7.1200 9.0718 1.4350 1.7519 1.5473 7.1384 3.8596 1.9022 1.1103 4.0332 1.2025 1.5814 6.4040 10.6530 1.0956 2.8190 9.9767 8.6301 9.4771 1.0575 1.1059 1.0916 1.0933
irintensity: 0.4157 1.5350 7.4153 2.1591 0.4978 0.0433 0.3007 0.6748 0.8411 0.4760 0.1666 0.1523 1.8021 10.4221 11.9326 8.9149 15.5706 59.9628 0.7085 6.0083 16.1969 7.8370 31.2044 21.6000 13.9732 20.2864 8.7127 94.5236 47.8307 9.3504 4.8433 193.2848 6.0690 6.2527 89.3675 15.2168 25.8974 112.3007 0.5223 150.1841 45.8334 14.7423 0.7772 15.7342 1.1850
temp: 298.150 k
press: 1.00000 atm
elementType: 17 17 17 17 8 6 6 6 6 6 6 6 6 1 1 1 1
symmnumber: 1
zpe: 255095.5 jmol-1
zpe.correction: 0.097161 hartree
zpe.thermalcorrener: 0.109946 hartree
zpe.thermalcorrenthalpy: 0.110890 hartree
zpe.thermalcorrgfe: 0.054726 hartree
zpe.sumelectzpe: -2221.764318 hartree
zpe.sumelectthermal: -2221.751533 hartree
zpe.sumelectthermalent: -2221.750589 hartree
zpe.sumelectthermalfe: -2221.806753 hartree
dipole: -1.7864 3.2212 0.2902
dipole: 3.6948
quadrupole: -115.6381 -104.0859 -102.0546
quadrupole: 6.1612 0.2881 -1.0089
quadrupole: -8.3785 3.1736 5.2049 6.1612 0.2881 -1.0089
hfenergy: -2221.861479 hartree
pointgroup: C01 [X(C8H4Cl4O1)]
dipole: 0.744623 -1.05006 0.6752566 debye
dipolederiv: -0.3979689 -0.2392979 0.197076 -0.2038169 -0.3868414 0.2370938 0.1673827 0.2383644 -0.1941828 -0.3674052 -0.24641 0.2059054 -0.3087671 -0.2698948 0.2071307 0.2411997 0.1939542 -0.1679675 -0.7888905 0.1811143 -0.0298024 0.2188273 -0.0862468 0.0280439 -0.0575521 0.0335985 -0.0200637 -0.5198722 0.1211398 0.0280666 0.2172168 -0.1814831 -0.0365085 -0.003235 -0.0122743 -0.118349 -0.6776459 0.1176862 -0.0201343 0.2818771 -0.5739922 0.2451788 -0.1548892 0.2433504 -0.5024148 -0.8979152 0.163668 0.0123498 0.0908253 -0.1744571 0.1281946 0.0810944 0.0990522 -0.0844696 0.7028 0.4052091 -0.3369966 0.1534251 0.5500063 -0.4015259 -0.1285723 -0.4353238 0.2102224 -0.0269288 -0.2041034 0.1413564 0.0687458 -0.1312334 0.0574732 -0.0959059 0.0992905 -0.0844167 1.5219514 -0.330874 -0.0074634 -0.2099518 0.521306 -0.3759195 -0.0912194 -0.2936869 0.5034814 0.2705635 0.6500797 -0.4665737 0.5761537 0.2899622 -0.2946023 -0.4139597 -0.3014632 0.1888628 -0.5803846 -0.054447 0.0909829 -0.1198784 -0.1201185 0.0657005 0.1357701 0.0569631 -0.0863321 1.1534776 -0.4085103 0.1366542 -0.3073224 0.1426821 -0.0812285 0.075638 -0.0681601 -0.0021514 0.3940911 -0.2793728 0.1021904 -0.5339754 0.1603957 0.1631301 0.227729 0.0956461 -0.0030908 0.1617124 0.0128123 -0.0072645 -0.0265087 0.1067297 0.0323948 0.0380408 0.0342312 0.1338104 0.0785317 0.0079229 0.0035344 0.0192661 0.071519 0.0598892 -0.0052253 0.0579997 0.1310696 0.0195463 0.0556435 0.0151764 0.0449226 -0.0096303 -0.0438114 0.0375664 -0.0422832 0.0900496 -0.0456625 0.0477398 -0.0650576 0.0389609 0.0912967 0.0093666 -0.0538621 0.0007412 0.0059421 unknown
polarizability: 202.8922791|-8.6813081|113.3207524|-16.9794329|-40.1412598|79.0984853 unknown
InChI: InChI=1S/C8H4Cl4O/c9-3-8(13)4-1-6(11)7(12)2-5(4)10/h1-2H,3H2
charge 0 multiplicity 1
17 atoms
Cl -1.02606 -1.982615 1.472533
Cl 3.126253 1.92933 -1.50446
Cl 4.126999 -0.739197 0.14575
Cl -4.521122 1.249548 0.484377
O  -2.043778 1.787111 -1.056549
C  -0.398387 0.351843 -0.067736
C  0.073495 -0.795641 0.624767
C  0.586601 1.155383 -0.713469
C  -1.822043 0.864297 -0.231688
C  1.951565 0.848858 -0.66361
C  1.442452 -1.123515 0.682077
C  2.385526 -0.297192 0.042518
C  -2.943314 0.273826 0.625763
H  0.229329 2.033142 -1.261625
H  1.775316 -2.016025 1.217173
H  -3.179774 -0.753137 0.305063
H  -2.670056 0.255386 1.692017
