program: Gaussian 09
title: 000193310
version: EM64L-G09RevD.01
frameworkgroup: C1[X(C13H25NO5)]
method: RPBEPBE
basis: SDD
operation: Freq
keyword: #p
keyword: freq=noraman
keyword: PBEPBE/SDD
title: #p freq=noraman PBEPBE/SDD
converged: YES YES NO NO
title: Mulliken charges:
elementType: O O O O O N C C C C C C C C C C C C C H H H H H H H H H H H H H H H H H H H H H H H H H
charge: -0.507574 -0.294563 -0.461905 -0.405859 -0.243749 -0.380443 -0.361019 -0.437127 -0.379658 -0.044821 -0.374939 -0.353818 -0.592300 -0.356685 0.211843 -0.113376 -0.696811 -0.374194 0.161939 0.235458 0.179323 0.204117 0.231897 0.183732 0.205585 0.220837 0.196253 0.186755 0.185791 0.191006 0.254103 0.226454 0.196663 0.193606 0.379968 0.276932 0.352593 0.208844 0.214835 0.210631 0.241649 0.242696 0.394176 0.391152
chargesum: 0.00000
title: Mulliken charges with hydrogens summed into heavy atoms:
elementType: O O O O O N C C C C C C C C C C C C C
charge: -0.127606 -0.294563 -0.067730 -0.014707 -0.243749 -0.027849 0.053763 -0.001114 0.009659 0.176017 0.008069 0.022978 -0.111743 0.033584 0.211843 0.163556 -0.062501 0.110152 0.161939
polarizability: 1.83039469e+02 9.82866825e-01 1.69466650e+02 -8.54670606e+00 -2.52148485e-01 1.40910566e+02
1716.lowfreq: -7.8700 -3.4121 0.0006 0.0008 0.0009 8.8499 14.4785 29.9945 36.8885
frequency: 14.2719 29.8540 36.6800 48.1713 51.8984 69.0611 89.3610 90.7125 98.8429 110.5099 127.1901 135.6830 142.0286 155.2671 175.5849 193.5762 222.1799 235.4879 256.4535 259.5105 274.4131 312.7917 335.7397 358.7584 388.3293 446.5534 462.4835 465.4130 510.3924 519.2731 522.5260 559.8825 606.9202 649.6290 674.3447 722.1157 729.1285 748.0177 749.8013 757.1270 784.0753 803.2492 813.7168 849.8220 877.4729 888.6683 901.1578 916.1784 953.3170 974.5184 995.1949 1001.7584 1004.4182 1020.9882 1035.0065 1043.1977 1057.0446 1065.6012 1080.8058 1082.4848 1105.5956 1120.0239 1132.3624 1166.0009 1188.8692 1204.2325 1217.7352 1225.7559 1228.8847 1237.9701 1258.1292 1264.7057 1268.6424 1277.2231 1282.1891 1286.8175 1294.3917 1298.6965 1308.4631 1324.2366 1339.8648 1352.9153 1353.4377 1356.6162 1381.5792 1387.6074 1388.1479 1426.3876 1455.6706 1458.6986 1462.4693 1462.9611 1468.6337 1469.0785 1476.2844 1477.3557 1483.7812 1488.6658 1503.5224 1594.8388 1651.8255 2950.4151 2950.8663 2957.1409 2962.0923 2967.2157 2969.4901 2970.8385 2978.5867 2986.3318 2997.7309 3010.1443 3014.1443 3016.4280 3022.9700 3024.5174 3034.6835 3055.1150 3067.6035 3069.5211 3089.3915 3093.5000 3218.3057 3486.8878 3497.6553 3527.4312
redmass: 5.2997 5.1645 1.5716 4.2368 4.5974 6.7305 2.2120 3.6802 3.8791 4.5755 4.3920 2.6460 2.2211 3.4652 3.4449 6.6943 4.6689 1.1120 3.7607 4.1111 4.4775 3.9061 3.4181 3.0675 2.8237 2.9665 3.2762 2.5675 2.1636 3.0719 1.8101 3.3650 1.9263 2.6045 1.2475 1.0627 1.1119 2.3939 3.2303 1.7436 1.2482 2.2692 1.9377 2.2036 2.1976 1.8799 2.2853 1.6209 2.1649 3.3555 3.3999 3.6567 1.5827 2.1692 2.8396 2.1407 2.7546 2.3076 2.4367 2.1749 1.5774 1.9356 2.2361 1.6739 1.7034 1.1225 1.2552 1.2768 1.3672 1.3555 1.3157 1.2503 1.3080 1.4953 1.0421 1.2123 1.0838 1.1839 1.3077 1.3526 1.4168 1.6337 1.6537 1.5995 1.6062 1.5365 1.2913 1.1281 1.0893 1.1143 1.0729 1.0682 1.0807 1.1019 1.0778 1.0431 1.0845 1.0910 2.1123 7.1330 7.9533 1.0590 1.0592 1.0602 1.0641 1.0589 1.0623 1.0367 1.0847 1.0955 1.0981 1.0649 1.0972 1.0684 1.0794 1.0947 1.1042 1.1020 1.1007 1.0992 1.1030 1.1051 1.0710 1.0779 1.0658 1.0643
irintensity: 0.0075 0.6408 0.0155 0.8831 1.3213 1.0563 4.6165 3.4859 11.2776 2.2151 1.7913 1.4439 4.5615 4.3123 11.9509 8.8694 9.9017 0.0036 2.4478 2.6614 0.5668 1.2773 0.2480 4.9264 19.8974 79.2188 1.7837 20.7022 108.4314 12.5999 88.2969 66.0960 43.1563 91.9809 148.4052 14.3393 0.8906 0.1153 3.6181 6.0866 36.6112 32.0795 12.9185 1.4810 23.5850 3.7602 10.0231 6.0116 42.9257 19.5126 2.9900 106.1666 28.2006 24.2318 30.1264 18.1990 9.6588 179.6185 1.0597 3.8145 25.0374 10.5628 23.2785 32.3840 1.7365 13.1097 7.2042 6.9664 5.7233 37.3333 8.6780 10.7403 3.1347 14.6992 2.2252 12.5385 0.8383 6.8995 2.1103 8.9986 0.8054 44.3713 20.0494 0.3941 51.2482 17.3245 21.7105 28.2667 4.6701 22.5129 0.7030 1.1011 0.8267 17.8283 1.7511 11.9549 3.8581 25.7421 199.8914 237.1809 160.4536 1.1400 0.4714 15.6120 12.3847 81.9409 68.9028 36.1603 58.5679 6.2241 3.8937 22.9033 4.6767 12.7173 39.5983 21.7673 42.1823 97.7832 100.1038 55.7873 11.7336 31.2084 421.3391 72.1276 25.2480 40.9839
temp: 298.150 k
press: 1.00000 atm
elementType: 8 8 8 8 8 7 6 6 6 6 6 6 6 6 6 6 6 6 6 1 1 1 1 1 1 1 1 1 1 1 1 1 1 1 1 1 1 1 1 1 1 1 1 1
symmnumber: 1
zpe: 984137.3 jmol-1
zpe.correction: 0.374838 hartree
zpe.thermalcorrener: 0.397303 hartree
zpe.thermalcorrenthalpy: 0.398248 hartree
zpe.thermalcorrgfe: 0.320350 hartree
zpe.sumelectzpe: -939.723005 hartree
zpe.sumelectthermal: -939.700539 hartree
zpe.sumelectthermalent: -939.699595 hartree
zpe.sumelectthermalfe: -939.777492 hartree
dipole: 0.0723 -0.3078 -2.2324
dipole: 2.2546
quadrupole: -121.1710 -104.8324 -119.4924
quadrupole: -10.3726 2.2885 4.4813
quadrupole: -6.0057 10.3329 -4.3271 -10.3726 2.2885 4.4813
hfenergy: -940.0978426 hartree
pointgroup: C01 [X(C13H25N1O5)]
dipole: 0.0022297 0.0886545 0.8826011 debye
polarizability: 182.1275905|-2.1796167|169.6823582|10.044606|0.0791394|141.6067363 unknown
InChI: InChI=1S/C13H25NO5/c1-2-3-4-5-6-7-10(16)8-12(17)14-11(9-15)13(18)19/h10-11,14-16,18H,2-9H2,1H3
charge 0 multiplicity 1
44 atoms
O  -0.620017 2.111496 -1.109499
O  -3.47547 2.074994 -0.600653
O  -1.285085 -0.57215 -1.682839
O  -3.755794 -3.149348 -0.431952
O  -2.435334 -2.376447 1.318639
N  -2.812177 0.207327 0.617976
C  1.928154 1.264385 0.124743
C  0.5502 1.2287 0.822257
C  2.867595 0.137771 0.608773
C  -0.398296 2.340167 0.346603
C  4.248942 0.163843 -0.083281
C  5.198125 -0.95406 0.403553
C  -1.769233 2.382317 1.11739
C  6.577892 -0.931579 -0.293063
C  -2.792176 1.551994 0.343855
C  -3.376738 -0.778386 -0.309482
C  7.521528 -2.049551 0.200635
C  -2.727712 -0.662314 -1.747527
C  -3.126496 -2.148399 0.298753
H  1.781605 1.18563 -0.968881
H  2.408137 2.248918 0.309326
H  0.687823 1.341232 1.917077
H  0.075204 0.24191 0.648731
H  3.007343 0.216722 1.707959
H  2.384797 -0.844283 0.425106
H  0.10274 3.322918 0.463414
H  4.108746 0.073242 -1.180558
H  4.727815 1.151037 0.088506
H  5.341544 -0.863017 1.500976
H  4.719716 -1.941501 0.234212
H  -2.151078 3.416183 1.156393
H  -1.619884 2.024481 2.152056
H  6.433548 -1.025117 -1.388882
H  7.054016 0.056536 -0.126325
H  -1.388348 2.66373 -1.417638
H  -4.467543 -0.640128 -0.43548
H  -2.230904 -0.183466 1.367966
H  7.704424 -1.961967 1.288483
H  8.500931 -2.009907 -0.311038
H  7.083194 -3.048396 0.014685
H  -2.978792 -1.575009 -2.311776
H  -3.182744 0.217163 -2.239255
H  -0.997493 0.38187 -1.525601
H  -3.544604 -4.038438 -0.03854
