program: Gaussian 09
title: 000193306
version: EM64L-G09RevD.01
frameworkgroup: C1[X(C16H25N)]
method: RPBEPBE
basis: SDD
operation: Freq
keyword: #pfreq=noraman
keyword: PBEPBE/SDD
title: #p freq=noraman PBEPBE/SDD
converged: YES YES NO NO
title: Mulliken charges:
elementType: N C C C C C C C C C C C C C C C C H H H H H H H H H H H H H H H H H H H H H H H H H
charge: -0.036780 -0.016791 -0.395087 -0.386833 -0.395137 -0.393236 -0.571794 -0.386665 -0.408080 -0.386524 -0.741094 0.167995 -0.529252 0.145869 -0.345960 -0.361579 -0.182117 0.194531 0.181870 0.219306 0.226195 0.179040 0.187810 0.186342 0.189273 0.197865 0.204596 0.230760 0.233671 0.191215 0.202607 0.189088 0.207260 0.214415 0.203979 0.215321 0.225805 0.219786 0.211593 0.239642 0.239129 0.231965
chargesum: 0.00000
title: Mulliken charges with hydrogens summed into heavy atoms:
elementType: N C C C C C C C C C C C C C C C C
charge: -0.036780 0.177741 0.006090 0.018402 -0.020985 -0.006098 -0.136438 0.038221 -0.016386 0.035151 -0.095989 0.167995 -0.097873 0.145869 -0.106318 -0.122450 0.049849
polarizability: 2.01115992e+02 4.13192182e+00 1.93571589e+02 -5.41762720e+00 9.89953795e+00 1.26681755e+02
1716.lowfreq: -9.9020 -0.0008 -0.0008 -0.0007 4.1246 6.4622 27.8426 52.0518 88.2475
frequency: 26.5424 51.7621 88.1937 106.8933 116.4249 144.7518 159.4973 202.0915 213.2423 222.1476 224.2836 233.6349 271.1763 289.8292 311.4495 348.9471 378.7840 383.1568 418.1834 433.7439 441.2205 466.1316 491.5694 538.0031 588.5114 671.3760 700.9224 716.7582 746.1418 757.3713 766.8190 796.5007 818.1229 824.1439 836.9897 870.0608 891.4843 899.1260 915.3170 927.0832 935.9758 955.9063 968.7632 983.6011 990.1314 994.9491 1026.4870 1037.2930 1063.9783 1068.0306 1090.1807 1093.4850 1103.7232 1109.7245 1123.2053 1146.9771 1162.5403 1171.9793 1183.3279 1190.7327 1217.0753 1227.6816 1243.3094 1258.4144 1263.3426 1270.2365 1290.9263 1294.0952 1298.6474 1308.1250 1312.8483 1323.8339 1330.9788 1335.1615 1339.1618 1346.1930 1353.7513 1358.7493 1363.1361 1383.5560 1400.3990 1443.7742 1456.9036 1460.7235 1462.5143 1463.7331 1464.1933 1470.5332 1473.6601 1474.8478 1479.6218 1481.4818 1482.8218 1568.2131 1577.6093 2948.4565 2949.7483 2957.7068 2958.4819 2963.7434 2967.7600 2970.6376 2973.1977 2986.6489 2995.6820 3000.1771 3000.9424 3010.8116 3017.4043 3026.2915 3036.7493 3041.0902 3048.4454 3059.2041 3062.4273 3062.9486 3067.1566 3127.9514 3144.9346 3160.6129
redmass: 3.5604 2.9891 3.7361 3.8557 3.1852 2.8222 2.3159 2.2771 2.2019 2.3518 2.7076 1.2576 2.8653 2.1686 2.8013 2.0986 2.0736 2.6988 1.9538 3.1467 2.3809 3.1069 2.3126 4.1316 4.3838 2.9906 3.0898 1.5390 1.6688 1.4191 1.4997 2.2312 2.2075 2.1659 2.0642 1.9604 1.9564 1.9361 1.7107 2.0176 1.7262 3.2768 2.5608 1.8297 1.3626 1.8315 2.0074 1.7455 1.8980 2.4724 2.0083 1.9663 1.8616 2.2173 1.3671 1.3388 1.3902 1.2048 1.3794 1.3442 1.4972 1.5362 1.5051 1.7680 1.4422 1.2903 1.3707 1.2281 1.4468 1.4826 1.2376 1.8801 1.3847 1.4073 1.4199 1.3894 1.4231 1.4963 1.5076 1.2280 2.6870 2.4014 1.0845 1.0847 1.0827 1.0873 1.1235 1.1010 1.0766 1.0616 1.0846 1.0554 1.0915 6.8805 5.4219 1.0644 1.0780 1.0619 1.0607 1.0645 1.0366 1.0629 1.0631 1.0624 1.0628 1.0616 1.0985 1.0983 1.0973 1.0921 1.1029 1.1004 1.0996 1.0992 1.0999 1.1021 1.0993 1.0866 1.0927 1.1004
irintensity: 0.3071 0.7206 2.4315 0.2642 0.2326 0.3944 0.4393 0.3704 0.0720 2.1109 0.2176 0.1098 1.1968 0.5857 1.8026 1.7610 1.2764 1.0464 1.2197 0.6541 0.4360 0.4931 1.9442 4.2948 3.0515 3.9556 2.5923 4.9164 8.6175 40.9468 13.7148 1.5220 0.1930 9.7876 6.8370 2.2142 0.6876 2.2063 0.7516 1.2518 0.9100 0.9211 1.7466 1.0318 0.4086 3.8634 0.5858 3.5613 4.9314 4.1156 1.5373 5.2742 2.3043 1.7893 1.1699 3.1532 1.0541 4.7385 0.9445 4.4434 11.2701 8.8674 2.1818 7.9856 2.8443 3.1645 12.4846 0.6520 0.6984 5.5392 1.0405 0.1231 0.8616 0.9820 5.1119 3.1573 4.2463 0.0267 5.3927 14.9807 3.1575 56.5675 0.2833 5.4919 13.2259 13.8745 12.8185 3.8360 6.1433 7.1952 1.7672 9.1410 30.6864 54.1832 44.1070 40.1966 12.3846 23.4494 25.6394 79.7919 39.1569 46.7641 44.8820 20.8167 41.7390 15.7460 37.1047 7.5896 44.7078 48.2658 55.5036 105.6510 71.1390 20.2375 59.8110 24.2420 65.6149 3.7198 22.5802 21.1693
temp: 298.150 k
press: 1.00000 atm
elementType: 7 6 6 6 6 6 6 6 6 6 6 6 6 6 6 6 6 1 1 1 1 1 1 1 1 1 1 1 1 1 1 1 1 1 1 1 1 1 1 1 1 1
symmnumber: 1
zpe: 983981.4 jmol-1
zpe.correction: 0.374779 hartree
zpe.thermalcorrener: 0.391522 hartree
zpe.thermalcorrenthalpy: 0.392466 hartree
zpe.thermalcorrgfe: 0.330979 hartree
zpe.sumelectzpe: -678.133518 hartree
zpe.sumelectthermal: -678.116775 hartree
zpe.sumelectthermalent: -678.115831 hartree
zpe.sumelectthermalfe: -678.177318 hartree
dipole: -1.1499 0.8399 0.6918
dipole: 1.5831
quadrupole: -99.6054 -99.0166 -107.9971
quadrupole: 0.2531 -0.7256 2.6483
quadrupole: 2.6010 3.1898 -5.7908 0.2531 -0.7256 2.6483
hfenergy: -678.5082971 hartree
pointgroup: C01 [X(C16H25N1)]
dipole: -0.3320105 -0.4528151 -0.2695688 debye
polarizability: 202.8178911|-1.1681963|191.9671891|1.9904696|10.8164742|126.5842557 unknown
InChI: InChI=1S/C16H25N/c1-14-9-6-4-2-3-5-7-10-15-11-8-12-16(13-14)17-15/h8,11-12,14H,2-7,9-10,13H2,1H3
charge 0 multiplicity 1
42 atoms
N  -0.292338 -0.8646 0.691736
C  -2.291632 1.710755 0.017553
C  -0.883934 2.115751 -0.495968
C  0.073024 2.658609 0.589956
C  1.429166 3.161875 0.027749
C  2.324625 2.059211 -0.595727
C  -2.262308 0.555108 1.078931
C  2.890508 1.049089 0.43404
C  3.568683 -0.179911 -0.227426
C  2.550796 -1.218964 -0.768456
C  -3.226759 1.367329 -1.166207
C  -1.654738 -0.748152 0.590877
C  1.83742 -2.032464 0.369246
C  0.322777 -2.012211 0.262148
C  -2.450108 -1.798173 0.059205
C  -0.416142 -3.09814 -0.272608
C  -1.820949 -2.985435 -0.373827
H  -2.721576 2.588937 0.547339
H  -1.014883 2.892074 -1.280273
H  -0.421866 1.240839 -0.991494
H  0.257766 1.865573 1.338125
H  -0.424475 3.496044 1.123259
H  1.995258 3.659726 0.842917
H  1.232072 3.942348 -0.736952
H  3.173802 2.539131 -1.125201
H  1.749363 1.516367 -1.371575
H  -3.302355 0.374394 1.413008
H  -1.683997 0.893039 1.957185
H  2.073225 0.696906 1.092296
H  3.620616 1.574889 1.082878
H  4.236517 -0.682297 0.501916
H  4.217762 0.167202 -1.05815
H  3.062453 -1.921085 -1.454877
H  1.789571 -0.692748 -1.374919
H  -4.245546 1.111503 -0.817096
H  -3.311215 2.225489 -1.858591
H  -2.839427 0.506721 -1.743083
H  2.109565 -1.590945 1.345575
H  2.198514 -3.0772 0.36753
H  -3.537083 -1.68203 -0.001571
H  0.101817 -4.006967 -0.596198
H  -2.415767 -3.811389 -0.779469
